program: Gaussian 09
title: 000091150
version: EM64L-G09RevD.01
frameworkgroup: C1[X(C13H22)]
method: RPBEPBE
basis: SDD
operation: Freq
keyword: #p
keyword: freq=noraman
keyword: PBEPBE/SDD
title: #p freq=noraman PBEPBE/SDD
converged: YES YES NO NO
title: Mulliken charges:
elementType: C C C C C C C C C C C C C H H H H H H H H H H H H H H H H H H H H H H
charge: -0.520451 0.419698 -0.471480 -0.301825 -0.458376 -0.294578 -0.829208 -0.440417 0.403999 -0.789530 -0.791928 -0.023725 -0.597685 0.215224 0.190287 0.205638 0.202298 0.214108 0.201032 0.213144 0.211573 0.225395 0.217560 0.227659 0.206327 0.206740 0.214740 0.225913 0.216131 0.224683 0.217122 0.216425 0.212187 0.213877 0.217443
chargesum: 0.00000
title: Mulliken charges with hydrogens summed into heavy atoms:
elementType: C C C C C C C C C C C C C
charge: -0.114940 0.419698 -0.063544 -0.087717 -0.044200 -0.083005 -0.158593 -0.027350 0.403999 -0.132747 -0.133697 0.188462 -0.166365
polarizability: 1.66493123e+02 2.32474948e+01 1.40660056e+02 -3.12276191e+00 -4.64506406e+00 1.19791911e+02
1716.lowfreq: -6.6633 -0.0005 0.0005 0.0007 7.5674 12.2483 19.5296 33.5037 38.6818
frequency: 17.0958 33.4396 38.2880 51.7908 55.2452 77.7366 88.8306 112.9334 122.8672 149.5831 185.0074 208.2438 274.3205 290.7803 307.7747 332.6051 361.3705 393.2981 407.7606 439.1519 472.2495 504.5302 513.0563 555.1795 634.5119 729.8409 764.7663 798.2222 836.4951 846.7316 885.2374 919.2429 932.1129 940.2777 948.1723 975.4566 984.8100 988.6988 993.1107 1004.7529 1014.6637 1028.9952 1040.2837 1069.4566 1081.6320 1112.1080 1125.5528 1153.4969 1192.0824 1204.7803 1221.0332 1236.8671 1254.5794 1272.9698 1290.0003 1297.1488 1318.0837 1325.5348 1358.1593 1367.9256 1387.8579 1395.9187 1398.0537 1424.2122 1453.5922 1456.3691 1458.2663 1463.0884 1465.8558 1471.0502 1472.1920 1473.4633 1480.5166 1481.7372 1656.1013 1689.3095 1697.3248 2954.8369 2960.1599 2961.2087 2961.8020 2963.1740 2975.9484 2978.0987 3020.5061 3025.0974 3026.0145 3028.4668 3029.0503 3042.0716 3043.2307 3068.2875 3069.2870 3072.4916 3077.8998 3089.1507 3089.7181 3095.2458 3192.6076
redmass: 2.3722 3.6196 2.5618 2.6128 2.6513 2.7679 2.4168 1.1394 1.1300 2.1417 1.6702 1.7019 2.3493 2.3819 2.3859 2.8706 2.3311 2.4470 2.1207 2.2846 2.1759 2.5029 2.3746 2.2400 1.5642 1.9706 1.9087 1.9045 1.3276 1.5776 1.8950 1.6695 1.8165 1.3511 1.4013 1.6127 1.5980 2.4121 1.3004 1.2725 3.5908 1.7798 1.5443 1.5866 1.6709 1.6311 2.2300 1.5978 1.6941 1.1781 1.7689 1.9338 1.3530 1.1169 1.2443 1.3382 1.3321 1.4297 1.4174 1.3943 1.3150 1.2912 1.2455 1.1737 1.0676 1.0665 1.0802 1.0813 1.0743 1.0634 1.0833 1.0665 1.0813 1.0828 4.7282 6.8474 6.5297 1.0375 1.0541 1.0600 1.0404 1.0467 1.0618 1.0628 1.0953 1.0969 1.0991 1.0963 1.0966 1.0956 1.0979 1.0857 1.0894 1.0877 1.0963 1.0749 1.0939 1.0952 1.1145
irintensity: 0.0031 0.0088 0.0879 0.3340 0.1320 0.4276 0.3266 0.3062 0.1598 1.0726 0.7833 0.0748 0.3896 0.9731 0.5924 0.5753 1.3967 1.4266 2.4892 3.5006 3.9470 2.5777 2.9947 9.4231 15.2158 3.1323 4.8543 0.6818 24.4471 16.9166 8.0707 4.4928 4.8284 71.2088 0.9630 6.9196 2.8183 2.7574 3.0126 10.6214 0.1351 0.9020 1.1937 28.3724 6.3066 5.5900 3.5835 6.2580 5.1064 0.7482 2.1284 3.5746 1.3145 0.8551 1.0482 0.5072 0.0656 0.0453 0.4620 1.2776 20.6499 24.3922 12.4195 3.2265 1.1597 3.8314 1.5440 2.9813 14.8693 30.0181 13.0881 7.8743 9.5142 20.7045 22.6069 1.8095 2.9995 34.7340 22.0087 30.3241 44.1318 26.6063 73.4363 81.2990 1.2261 0.9834 12.3771 82.9740 22.0812 27.1312 19.4309 8.0204 3.8024 76.0546 66.3659 1.9680 44.2190 36.0009 33.4392
temp: 298.150 k
press: 1.00000 atm
elementType: 6 6 6 6 6 6 6 6 6 6 6 6 6 1 1 1 1 1 1 1 1 1 1 1 1 1 1 1 1 1 1 1 1 1 1
symmnumber: 1
zpe: 814598.3 jmol-1
zpe.correction: 0.310264 hartree
zpe.thermalcorrener: 0.327332 hartree
zpe.thermalcorrenthalpy: 0.328276 hartree
zpe.thermalcorrgfe: 0.262857 hartree
zpe.sumelectzpe: -507.484687 hartree
zpe.sumelectthermal: -507.467619 hartree
zpe.sumelectthermalent: -507.466675 hartree
zpe.sumelectthermalfe: -507.532094 hartree
dipole: -0.4197 -0.1115 0.4215
dipole: 0.6052
quadrupole: -84.3776 -82.6179 -80.0287
quadrupole: 1.5194 0.9405 -2.6184
quadrupole: -2.0362 -0.2765 2.3127 1.5194 0.9405 -2.6184
hfenergy: -507.7949509 hartree
pointgroup: C01 [X(C13H22)]
dipole: -0.1620002 -0.0335119 0.1712565 debye
polarizability: 166.5517581|22.7708767|139.8182439|-5.3664527|-6.2151945|120.5750881 unknown
InChI: InChI=1S/C13H22/c1-5-6-7-10-13(4)11-8-9-12(2)3/h5,9-10H,1,6-8,11H2,2-4H3
charge 0 multiplicity 1
35 atoms
C  -2.003867 -1.730634 -0.636303
C  -0.607444 -1.787893 -0.024234
C  -2.896996 -0.576178 -0.058197
C  0.464546 -1.284833 -0.702977
C  1.908207 -1.197966 -0.253561
C  -2.489233 0.790998 -0.567143
C  -0.536094 -2.413736 1.358827
C  2.387181 0.282486 -0.107068
C  -1.85085 1.789941 0.108041
C  -1.499823 3.098287 -0.584147
C  -1.426657 1.713708 1.564059
C  3.83542 0.384203 0.320602
C  4.820397 1.009637 -0.372906
H  -1.932097 -1.598728 -1.73309
H  -2.528323 -2.692781 -0.458646
H  -3.944261 -0.775904 -0.364569
H  -2.883837 -0.617575 1.046502
H  0.270222 -0.857184 -1.700056
H  2.066416 -1.725203 0.705924
H  2.564272 -1.695405 -0.99673
H  -2.725663 0.971382 -1.628658
H  0.466047 -2.349534 1.813182
H  -1.250711 -1.927982 2.052413
H  -0.819536 -3.484359 1.315837
H  2.235701 0.816382 -1.065113
H  1.735546 0.777846 0.642819
H  -1.965995 3.961758 -0.06843
H  -1.832418 3.10764 -1.636878
H  -0.405154 3.274326 -0.567772
H  -1.693944 0.757871 2.04251
H  -1.885726 2.534106 2.151222
H  -0.328347 1.837816 1.651716
H  4.086723 -0.107191 1.275025
H  5.853085 1.04079 -0.006878
H  4.619813 1.509307 -1.329226
