program: Gaussian 09
title: 000091276
version: EM64L-G09RevD.01
frameworkgroup: C1[X(C17H26N2O3)]
method: RPBEPBE
basis: SDD
operation: Freq
keyword: #p
keyword: freq=noraman
keyword: PBEPBE/SDD
title: #p freq=noraman PBEPBE/SDD
converged: YES YES NO NO
title: Mulliken charges:
elementType: O O O N N C C C C C C C C C C C C C C C C C H H H H H H H H H H H H H H H H H H H H H H H H H H
charge: -0.289859 -0.263996 -0.462145 -0.093338 -0.366728 -0.354350 -0.381905 -0.389241 -0.389351 -0.400471 -0.472416 0.469962 -0.531401 -0.471606 0.380739 -0.208489 -0.393728 -0.263418 -0.422000 -0.351805 0.215328 -0.433035 0.161086 0.204445 0.166198 0.263678 0.202923 0.184503 0.191422 0.218367 0.207830 0.183074 0.220246 0.188270 0.291992 0.231668 0.217860 0.241757 0.208515 0.208382 0.193513 0.227702 0.274239 0.218768 0.322538 0.259755 0.231032 0.353491
chargesum: 0.00000
title: Mulliken charges with hydrogens summed into heavy atoms:
elementType: O O O N N C C C C C C C C C C C C C C C C C
charge: -0.289859 -0.263996 -0.108654 -0.093338 -0.044190 0.011180 0.047971 -0.001815 0.020438 -0.009566 -0.063900 0.469962 -0.239409 -0.239938 0.380739 0.009370 -0.151971 0.153478 -0.000785 0.141202 0.215328 0.057752
polarizability: 2.43705538e+02 -1.31322546e+01 1.89239165e+02 1.54585528e+01 1.75587155e+01 1.79718989e+02
1716.lowfreq: -13.8862 -4.8438 -3.9595 -0.0007 -0.0006 -0.0005 10.5295 21.0769 26.1672
frequency: 6.1995 20.9941 25.9082 36.2340 43.8071 54.8626 67.4379 82.7513 114.4021 129.0461 138.3776 168.0858 204.2564 222.2825 241.0231 248.1422 250.7146 273.5084 288.0128 291.7811 298.2859 303.4934 353.1645 383.6163 414.2176 443.7187 447.0037 459.2153 464.7966 493.9363 549.4942 560.3636 562.6187 601.3820 607.0131 626.7356 695.0787 729.9275 739.1892 759.1279 780.2017 792.6096 804.5845 850.0111 853.0193 855.9268 864.9967 871.9061 894.1798 911.9454 925.7012 937.4852 956.7017 963.0611 977.7698 982.7188 989.8483 991.1213 1001.6836 1006.8168 1046.2680 1065.9393 1081.4395 1087.2064 1107.6828 1110.3171 1113.6206 1122.9886 1137.9218 1147.1031 1151.8501 1160.1508 1179.8135 1189.8940 1196.5810 1211.0444 1236.1655 1242.3816 1250.5942 1261.5468 1268.5250 1283.7109 1288.0205 1295.9273 1309.6774 1327.6433 1334.1764 1335.2418 1338.4175 1347.0178 1348.6611 1357.6343 1361.8810 1375.1250 1381.7310 1396.4911 1443.0764 1444.6804 1447.2973 1450.4791 1455.6305 1459.1492 1466.3965 1469.4206 1471.7865 1472.9029 1482.0197 1483.5423 1502.0306 1588.1023 1621.2593 1625.5148 2808.6886 2817.3729 2835.8411 2958.1605 2959.4244 2979.1044 2980.7643 2981.5346 2992.9565 2998.1548 3011.1350 3016.3898 3018.0330 3027.9376 3044.7725 3053.3888 3058.7795 3062.9541 3088.4148 3089.5072 3116.9500 3136.7854 3157.4888 3165.3283 3480.7041 3580.3888
redmass: 4.0406 6.2312 5.5747 4.9311 4.1820 3.7240 3.9975 4.9049 2.7861 3.9003 3.2422 3.4781 3.1700 2.7368 2.2801 2.9359 3.4019 2.7637 2.4271 1.3146 3.6837 2.3729 2.6793 1.7573 3.8083 2.9909 2.8949 3.1818 4.1144 2.7998 3.1440 3.0823 2.9136 4.1788 4.5401 3.7153 2.2335 2.1707 1.3985 3.2308 1.6531 1.7466 1.4943 2.3934 1.7791 2.4370 2.5079 1.5796 2.6425 2.4659 1.4440 2.0883 1.2917 1.3307 3.0199 3.5896 3.5162 2.2083 2.0849 2.0498 2.1202 2.0897 1.3925 1.8127 2.7992 2.6714 2.1231 2.6441 1.7929 1.1746 1.3136 2.2308 1.1727 1.2850 1.2438 1.3625 2.0032 1.5894 1.7601 1.2989 1.3112 1.1301 1.3751 1.4459 1.2778 1.2971 1.4413 1.1834 1.4803 1.3907 1.4993 1.3759 1.4553 1.5962 1.6090 3.4207 2.0779 1.0896 1.0942 1.0992 1.1970 1.0889 1.1305 1.3606 1.1188 1.4840 1.1041 1.1636 2.0012 6.2729 6.8322 8.1502 1.0711 1.0709 1.0696 1.0555 1.0628 1.0834 1.0638 1.0641 1.0671 1.0630 1.0865 1.0597 1.1063 1.0944 1.1033 1.0990 1.0903 1.0998 1.0956 1.1049 1.0861 1.0920 1.0973 1.0921 1.0764 1.0668
irintensity: 0.1355 0.9702 1.2131 1.1303 0.3392 1.2269 0.6960 5.1949 22.1857 4.6851 6.1114 0.9978 1.3895 4.3328 2.2084 1.3008 20.2797 2.0991 7.8980 158.2624 9.6430 2.1954 5.6419 3.5881 0.8243 3.8092 1.5155 2.3347 1.7799 1.4462 0.8393 10.3776 4.1440 0.8767 3.3596 10.5752 23.5176 67.4491 56.0260 5.2867 53.5597 1.9571 0.8464 4.8946 8.9790 4.5265 3.7425 0.9008 3.5199 5.0534 12.7273 67.4473 3.9893 0.1432 33.2605 48.5566 56.1648 17.6468 11.3982 12.8633 7.2008 10.1310 3.1746 22.2525 8.2874 6.1898 7.9211 6.2251 51.5809 37.3582 17.2866 42.8878 4.6744 1.6020 1.9277 6.5426 46.1293 33.0810 62.3327 22.4264 25.6806 9.8267 31.7936 8.4223 4.4122 16.3687 11.2726 25.4512 5.7833 1.6070 1.9580 1.2761 9.3078 8.2238 8.7741 4.2039 30.6527 36.8282 9.9942 16.6618 26.3834 16.4473 16.5659 25.3217 12.1591 17.3661 3.8176 4.5742 163.2965 45.9130 9.2207 326.1688 54.2741 66.4655 215.1850 35.1237 47.5235 30.5308 24.9440 30.6975 86.8739 27.1948 72.5972 22.4825 43.8875 69.6828 50.7562 35.3469 22.7948 58.1841 6.3295 10.7808 5.1092 30.0952 20.5047 4.6614 53.2777 12.9446
temp: 298.150 k
press: 1.00000 atm
elementType: 8 8 8 7 7 6 6 6 6 6 6 6 6 6 6 6 6 6 6 6 6 6 1 1 1 1 1 1 1 1 1 1 1 1 1 1 1 1 1 1 1 1 1 1 1 1 1 1
symmnumber: 1
zpe: 1072853.7 jmol-1
zpe.correction: 0.408628 hartree
zpe.thermalcorrener: 0.431055 hartree
zpe.thermalcorrenthalpy: 0.431999 hartree
zpe.thermalcorrgfe: 0.353024 hartree
zpe.sumelectzpe: -996.863416 hartree
zpe.sumelectthermal: -996.840990 hartree
zpe.sumelectthermalent: -996.840046 hartree
zpe.sumelectthermalfe: -996.919021 hartree
dipole: -3.8241 -1.4247 0.5485
dipole: 4.1176
quadrupole: -110.0341 -124.9637 -130.8403
quadrupole: 6.9790 6.9731 0.8712
quadrupole: 11.9120 -3.0176 -8.8943 6.9790 6.9731 0.8712
hfenergy: -997.2720448 hartree
pointgroup: C01 [X(C17H26N2O3)]
dipole: 1.2956602 -0.8806968 -0.4122876 debye
polarizability: 248.2779561|-3.3908523|188.3951963|2.8539279|-19.9446695|175.9905391 unknown
InChI: InChI=1S/C17H26N2O3/c20-14-17(21)18-8-5-11-22-16-7-4-6-15(12-16)13-19-9-2-1-3-10-19/h4,6-7,12,18,20H,1-3,5,8-11,13-14H2
charge 0 multiplicity 1
48 atoms
O  2.057354 0.962922 1.229023
O  0.621777 -2.118575 -0.425966
O  3.425036 -3.20114 -2.566967
N  -2.912064 0.700292 0.434856
N  2.949036 -2.218858 -0.093598
C  -4.301311 0.648298 0.949555
C  -2.633353 -0.413484 -0.510659
C  -4.569569 -0.685148 1.677378
C  -2.852465 -1.779857 0.166992
C  -4.280745 -1.88604 0.746783
C  -2.561587 2.026581 -0.116494
C  -1.057887 2.226488 -0.297489
C  -0.147238 1.554017 0.54267
C  -0.561606 3.089105 -1.31007
C  1.243614 1.71633 0.359871
C  0.829089 3.268166 -1.4691
C  1.74853 2.580598 -0.64251
C  3.431057 0.66227 0.798178
C  3.87108 -0.581962 1.578001
C  2.96361 -1.808055 1.318118
C  1.800478 -2.329883 -0.845302
C  2.057112 -2.704631 -2.31965
H  -5.048678 0.763983 0.117761
H  -4.450043 1.497429 1.644401
H  -3.294692 -0.333712 -1.415728
H  -1.586553 -0.339987 -0.850908
H  -3.911248 -0.740329 2.566164
H  -5.618595 -0.706236 2.032459
H  -2.661488 -2.583006 -0.56942
H  -2.102667 -1.89532 0.971651
H  -4.410355 -2.839026 1.295018
H  -5.016998 -1.889001 -0.084857
H  -2.942757 2.789295 0.593848
H  -3.069739 2.22849 -1.096236
H  -0.522292 0.863127 1.303148
H  -1.261684 3.607217 -1.976651
H  1.20765 3.939056 -2.249027
H  2.825176 2.724257 -0.779627
H  4.098129 1.520806 1.017764
H  3.445744 0.466431 -0.293407
H  4.924385 -0.810138 1.315295
H  3.846461 -0.361083 2.661764
H  1.922986 -1.562488 1.587211
H  3.296804 -2.651977 1.954043
H  3.823209 -2.434252 -0.586807
H  1.954726 -1.792898 -2.932113
H  1.28029 -3.424733 -2.637086
H  3.453086 -4.177942 -2.41088
