program: Gaussian 09
title: 000091128
version: EM64L-G09RevD.01
frameworkgroup: C1[X(C14H24O)]
method: RPBEPBE
basis: SDD
operation: Freq
keyword: #pfreq=noraman
keyword: PBEPBE/SDD
title: #p freq=noraman PBEPBE/SDD
converged: YES YES NO NO
title: Mulliken charges:
elementType: O C C C C C C C C C C C C C C H H H H H H H H H H H H H H H H H H H H H H H H
charge: -0.200647 -0.041059 0.039374 -0.039419 -0.562479 -0.502943 -0.475603 0.324078 -0.476922 -0.578292 -0.520760 0.182045 -0.749839 -0.758979 -0.750026 0.198095 0.179619 0.222356 0.206796 0.212374 0.214127 0.204074 0.203977 0.197245 0.217394 0.212289 0.220303 0.241310 0.242731 0.216211 0.217800 0.208975 0.209843 0.219544 0.220193 0.209273 0.209510 0.209539 0.217892
chargesum: 0.00000
title: Mulliken charges with hydrogens summed into heavy atoms:
elementType: O C C C C C C C C C C C C C C
charge: -0.200647 0.157037 0.218993 0.182937 -0.143309 -0.084742 -0.074381 0.324078 -0.047239 -0.116679 -0.061818 0.182045 -0.113221 -0.109968 -0.113085
polarizability: 1.81640087e+02 -7.05034138e-01 1.39459429e+02 -3.63190795e+00 5.31765188e-01 1.20836778e+02
1716.lowfreq: -12.8594 0.0001 0.0004 0.0006 9.8350 24.2116 34.2187 48.4924 97.4923
frequency: 33.4550 48.1560 97.4654 103.9759 140.6031 190.2360 203.3242 212.5209 232.6596 243.9275 259.1545 276.6015 308.6743 325.9449 343.8305 368.3046 390.4373 398.7556 432.8178 444.9574 457.7754 484.8852 495.7200 519.6444 548.7610 680.1962 740.8170 751.8918 776.3365 821.9203 840.4390 846.0419 902.4610 911.7207 918.1124 923.6161 934.8624 937.9290 958.0612 994.0415 996.5651 1013.2355 1023.6600 1041.0535 1063.5087 1068.4794 1100.8838 1106.9234 1114.2754 1128.5145 1146.7818 1162.3661 1185.0274 1208.0973 1222.7291 1235.5403 1245.2040 1249.7111 1259.1810 1266.8676 1271.2314 1293.3934 1301.4332 1311.8438 1314.2664 1317.2270 1331.1206 1340.3517 1345.8936 1349.1290 1364.1178 1373.5702 1376.0550 1400.9778 1436.5802 1446.5039 1455.2416 1460.5302 1462.4905 1464.7333 1466.2273 1469.5917 1471.0306 1484.7480 1487.4312 1498.2942 1632.6773 2918.4068 2921.9573 2941.0318 2954.7417 2960.6413 2962.1243 2965.7768 2968.3297 2969.1454 2970.9292 2972.6685 2977.0916 3020.0904 3026.3153 3033.9810 3045.0910 3055.8703 3059.8497 3060.4205 3066.2403 3068.8350 3071.8141 3075.0790 3076.4075
redmass: 2.4850 5.5965 3.6456 2.6446 2.9004 2.1029 1.3625 1.8505 1.8860 1.0325 1.8550 2.5189 1.8694 1.9668 2.4185 2.1693 2.5630 3.3363 2.7541 3.0353 2.7533 2.2892 2.3328 2.4747 2.8831 3.3471 2.2419 2.7255 2.1938 2.4652 2.3259 1.5850 1.9343 1.6852 1.7280 1.6910 1.3829 1.6556 1.7005 1.9101 2.0959 1.4282 1.7000 1.7732 1.3885 1.7492 2.4729 2.1402 2.4261 2.0659 1.6645 1.5804 1.6911 1.8090 2.4891 1.6922 1.6450 1.7417 1.6205 1.4683 1.3044 1.3614 1.4658 1.2825 1.3680 1.2962 1.3769 1.4949 1.6738 1.5836 1.5211 1.2073 1.2014 1.2084 1.0934 1.0883 1.0836 1.0606 1.0816 1.0872 1.0491 1.0561 1.0848 1.0521 1.0605 1.0577 9.2979 1.0814 1.0799 1.0794 1.0632 1.0617 1.0645 1.0367 1.0364 1.0656 1.0607 1.0588 1.0408 1.0979 1.1003 1.1002 1.0987 1.0996 1.0990 1.0962 1.0980 1.0993 1.0964 1.0978 1.0980
irintensity: 0.1729 2.9156 1.7195 1.5715 0.0617 0.4514 0.0125 0.0871 0.1547 0.0145 0.1315 0.3029 0.0701 0.1242 0.5664 0.2141 2.8426 0.7893 0.6945 1.4738 1.5906 0.9292 1.1732 3.4773 1.7077 2.7661 2.2363 1.3060 1.8957 1.4524 7.7534 3.3876 1.2934 4.4717 3.4785 1.8915 0.2510 0.4724 11.0132 3.5492 1.3889 1.2505 0.4422 4.4909 0.8607 2.9061 7.2995 0.7731 19.7085 3.7250 2.4303 2.4634 19.5479 9.9776 10.5841 14.8535 10.8303 16.9927 5.3617 11.3312 4.4124 5.6667 5.8671 4.9448 2.4242 5.5421 0.7203 4.2030 1.6002 1.3300 5.0932 21.3974 25.2734 17.9542 11.6321 14.5349 1.8805 0.6992 14.2482 8.2099 1.3562 1.2012 6.0542 9.1708 6.6427 30.7691 202.7432 3.7350 24.0810 7.8691 15.5426 2.3916 34.0091 29.5733 37.3251 20.1391 11.4496 78.9993 51.8464 45.2914 1.4942 77.6434 54.1679 0.8190 32.0325 33.2670 88.5394 14.7989 27.0374 54.9816 69.6579
temp: 298.150 k
press: 1.00000 atm
elementType: 8 6 6 6 6 6 6 6 6 6 6 6 6 6 6 1 1 1 1 1 1 1 1 1 1 1 1 1 1 1 1 1 1 1 1 1 1 1 1
symmnumber: 1
zpe: 917590.6 jmol-1
zpe.correction: 0.349492 hartree
zpe.thermalcorrener: 0.365206 hartree
zpe.thermalcorrenthalpy: 0.366150 hartree
zpe.thermalcorrgfe: 0.307353 hartree
zpe.sumelectzpe: -621.920252 hartree
zpe.sumelectthermal: -621.904539 hartree
zpe.sumelectthermalent: -621.903594 hartree
zpe.sumelectthermalfe: -621.962391 hartree
dipole: 3.6099 -0.6170 -1.4723
dipole: 3.9471
quadrupole: -119.3607 -92.2675 -93.3008
quadrupole: 3.4485 7.0409 -0.1308
quadrupole: -17.7177 9.3755 8.3422 3.4485 7.0409 -0.1308
hfenergy: -622.2697442 hartree
pointgroup: C01 [X(C14H24O1)]
dipole: 1.4288123 -0.2468198 -0.5560197 debye
polarizability: 181.7381293|-0.8420124|139.463574|-2.6309845|0.5394487|120.734591 unknown
InChI: InChI=1S/C14H24O/c1-14(2,3)12-6-4-11-9-13(15)7-5-10(11)8-12/h10-12H,4-9H2,1-3H3
charge 0 multiplicity 1
39 atoms
O  -4.751448 0.293377 0.544019
C  -0.770699 -0.599246 -0.352868
C  1.702197 0.140291 -0.297837
C  -1.214343 0.800235 0.146324
C  0.662321 -0.929957 0.136366
C  1.237734 1.532058 0.212858
C  -0.189641 1.877962 -0.272204
C  3.190974 -0.215745 0.086042
C  -1.78614 -1.680887 0.085003
C  -2.643694 1.146578 -0.358979
C  -3.227038 -1.366855 -0.406739
C  -3.651746 0.049827 -0.022427
C  4.152593 0.857156 -0.500836
C  3.401666 -0.286923 1.623545
C  3.582312 -1.586741 -0.535918
H  -0.756326 -0.567066 -1.466982
H  1.680938 0.179078 -1.412301
H  -1.241546 0.764163 1.258453
H  0.647769 -1.008363 1.243698
H  0.947402 -1.92638 -0.25128
H  1.933729 2.321978 -0.124512
H  1.250417 1.54283 1.32187
H  -0.496855 2.865097 0.12718
H  -0.193026 1.966644 -1.379787
H  -1.785308 -1.753123 1.192036
H  -1.476266 -2.672216 -0.299154
H  -2.605006 1.255341 -1.464428
H  -3.000763 2.103448 0.061763
H  -3.963689 -2.084117 -0.005516
H  -3.248249 -1.440722 -1.514659
H  4.024592 1.84123 -0.016014
H  5.205143 0.551049 -0.3510
H  3.989108 0.986897 -1.58822
H  2.759514 -1.056014 2.09054
H  3.187793 0.681243 2.111627
H  4.452486 -0.548978 1.8505
H  3.384079 -1.602153 -1.625293
H  4.661219 -1.780667 -0.385894
H  3.029498 -2.425125 -0.075481
