program: Gaussian 09
title: 000091120
version: EM64L-G09RevD.01
frameworkgroup: C1[X(C13H20O3)]
method: RPBEPBE
basis: SDD
operation: Freq
keyword: #pfreq=noraman
keyword: PBEPBE/SDD
title: #p freq=noraman PBEPBE/SDD
converged: YES YES NO NO
title: Mulliken charges:
elementType: O O O C C C C C C C C C C C C C H H H H H H H H H H H H H H H H H H H H
charge: -0.274820 -0.226911 -0.224042 -0.080315 -0.354506 -0.024554 -0.579474 0.466846 0.144570 -0.743664 -0.753826 -0.497306 0.213105 -0.830279 -0.231836 -0.670744 0.215851 0.270745 0.225958 0.277488 0.245959 0.206499 0.213313 0.232537 0.209627 0.216238 0.234766 0.255897 0.237377 0.236644 0.250979 0.231919 0.231141 0.216061 0.230885 0.227872
chargesum: 0.00000
title: Mulliken charges with hydrogens summed into heavy atoms:
elementType: O O O C C C C C C C C C C C C C
charge: -0.274820 -0.226911 -0.224042 0.135537 -0.083760 0.201405 -0.056028 0.466846 0.144570 -0.091315 -0.093194 -0.241409 0.213105 -0.105279 0.231224 0.004073
polarizability: 1.81902064e+02 6.29479733e+00 1.44155251e+02 1.64821481e+01 -2.62374390e+00 1.21754299e+02
1716.lowfreq: -16.2495 -0.0004 -0.0004 0.0007 5.1675 9.1614 17.3899 45.7500 50.3563
frequency: 14.6313 45.7273 50.1774 59.4075 89.1566 102.8170 130.4132 143.4984 154.6095 179.2833 192.4626 201.9296 214.8080 222.9351 255.2778 280.2262 305.9232 335.8280 344.9689 375.2054 380.8623 438.1137 448.1793 475.4988 517.1410 540.5909 545.3577 621.2039 710.9120 734.5796 798.3107 808.8866 814.3062 838.3199 869.9234 893.4978 910.5359 922.9662 939.3195 949.8711 960.6004 1012.7353 1016.0901 1021.9173 1047.5713 1084.9304 1097.4463 1113.4897 1130.1640 1134.9378 1148.7491 1160.5852 1175.3054 1184.5172 1248.3652 1251.4540 1268.0361 1268.2231 1293.4087 1308.6666 1321.8010 1324.3341 1342.0445 1346.7211 1357.2883 1382.5467 1396.5809 1399.3593 1401.0723 1436.4451 1456.1414 1463.8019 1464.7482 1467.4551 1473.2340 1479.9002 1483.7979 1485.9113 1496.5626 1583.0050 1630.3334 1650.5278 2947.4944 2967.5822 2968.6308 2972.7655 2980.5204 2996.2994 2997.4980 3012.0739 3027.1814 3042.9942 3058.6150 3066.4200 3069.9018 3070.6732 3074.6683 3085.0465 3093.1253 3096.5857 3107.6960 3130.9708
redmass: 3.9991 4.1806 2.6397 3.0213 3.7629 2.9999 3.5668 2.3221 1.8019 2.0329 1.7855 1.9965 1.3504 1.3685 1.4341 3.0405 5.1735 2.6856 3.1541 3.2838 3.3149 2.8900 2.7667 3.8715 4.3130 4.5323 2.7183 3.6776 4.1493 4.6059 1.1051 3.0017 3.7160 3.3912 2.4253 2.1586 1.8314 1.2397 2.5549 2.2451 1.4302 1.5468 2.2340 2.3248 1.6353 4.7634 2.6425 2.2486 1.9218 1.4669 2.2102 1.8553 1.8230 1.9320 1.1412 1.3834 1.2893 2.2574 1.3791 1.4127 1.4897 2.1720 1.3570 1.5333 1.4262 1.2049 1.2282 1.2027 1.2586 1.0818 1.0504 1.0507 1.0630 1.0511 1.0613 1.0447 1.0570 1.0684 1.0484 9.4219 8.1889 7.0320 1.0815 1.0371 1.0386 1.0434 1.0777 1.0358 1.0631 1.0583 1.0833 1.0943 1.0984 1.0984 1.0986 1.1065 1.0976 1.0972 1.0986 1.0993 1.1028 1.0921
irintensity: 0.1928 2.2541 0.1847 1.3502 0.0217 0.1748 2.1544 1.3224 0.5741 3.5770 1.7403 2.1513 1.6613 1.0306 2.2573 2.0903 11.9329 4.3814 1.0870 4.3628 2.9646 2.2282 3.6079 3.0160 3.5770 2.6090 1.8650 4.9080 2.6722 6.1494 3.5288 2.5911 0.7512 5.5313 0.7461 4.8903 27.7946 10.5644 10.9279 7.6384 0.0579 5.5722 2.4547 64.2589 8.8087 290.9412 99.0147 13.8356 18.0751 6.4898 4.5407 8.3814 8.4800 27.9069 0.1784 18.1894 21.4348 77.1255 6.5193 20.4810 11.7748 54.0234 9.9326 5.2317 1.7200 16.1551 32.0526 20.9594 26.3353 17.5611 11.4466 6.6959 22.3066 1.8363 2.0734 6.3051 5.3375 13.4157 24.1209 189.0539 70.4767 138.2778 11.8056 21.6208 18.2221 20.1821 31.0475 20.6474 5.8483 15.4800 11.4474 12.8116 6.9494 55.2947 46.0157 5.0340 30.0299 30.5006 29.1023 17.9232 42.6029 10.6855
temp: 298.150 k
press: 1.00000 atm
elementType: 8 8 8 6 6 6 6 6 6 6 6 6 6 6 6 6 1 1 1 1 1 1 1 1 1 1 1 1 1 1 1 1 1 1 1 1
symmnumber: 1
zpe: 797880.5 jmol-1
zpe.correction: 0.303897 hartree
zpe.thermalcorrener: 0.322054 hartree
zpe.thermalcorrenthalpy: 0.322999 hartree
zpe.thermalcorrgfe: 0.256638 hartree
zpe.sumelectzpe: -731.802433 hartree
zpe.sumelectthermal: -731.784276 hartree
zpe.sumelectthermalent: -731.783331 hartree
zpe.sumelectthermalfe: -731.849692 hartree
dipole: 5.4161 1.7409 2.8856
dipole: 6.3790
quadrupole: -102.2163 -95.3366 -100.3822
quadrupole: -10.9005 -7.8821 -5.2004
quadrupole: -2.9046 3.9751 -1.0705 -10.9005 -7.8821 -5.2004
hfenergy: -732.10633 hartree
pointgroup: C01 [X(C13H20O3)]
dipole: -2.2258231 -0.1995784 1.1421171 debye
polarizability: 182.7080391|-2.3729883|143.3285839|-15.6648712|6.0435332|121.7749911 unknown
InChI: InChI=1S/C13H20O3/c1-5-16-13(15)12-9(4)6-10(14)7-11(12)8(2)3/h6,8,11-12H,5,7H2,1-4H3
charge 0 multiplicity 1
36 atoms
O  -2.378421 0.50845 0.047782
O  3.754599 0.993857 -0.953953
O  -0.910357 0.107106 -1.712953
C  0.950081 -1.042486 0.401629
C  -0.075434 0.109831 0.643331
C  0.272746 -2.423835 0.131626
C  1.963258 -0.650329 -0.705036
C  0.605452 1.474607 0.821874
C  2.608681 0.716414 -0.482967
C  1.324098 -3.558679 0.052781
C  -0.784272 -2.776661 1.209318
C  1.843331 1.717752 0.290995
C  -1.115617 0.226372 -0.483881
C  -0.159068 2.51197 1.610995
C  -3.488395 0.680391 -0.94613
C  -4.747226 1.003685 -0.148958
H  1.511792 -1.134199 1.357902
H  -0.650022 -0.093885 1.564853
H  -0.238091 -2.362745 -0.851902
H  1.44329 -0.62073 -1.682894
H  2.78051 -1.386213 -0.78771
H  1.917804 -3.61171 0.986444
H  0.824659 -4.535516 -0.083057
H  2.024763 -3.427049 -0.789696
H  -0.33012 -2.783203 2.219892
H  -1.196931 -3.785366 1.023866
H  -1.635215 -2.071656 1.220502
H  2.332123 2.690526 0.427684
H  0.344744 3.492409 1.595732
H  -0.267176 2.19343 2.667199
H  -1.187093 2.630261 1.219201
H  -3.204446 1.487835 -1.644833
H  -3.578648 -0.257135 -1.52368
H  -5.60161 1.133632 -0.837883
H  -4.989875 0.18887 0.554304
H  -4.622715 1.936397 0.427424
