program: Gaussian 09
title: 000091190
version: EM64L-G09RevD.01
frameworkgroup: C1[X(C25H24N2O3)]
method: RPBEPBE
basis: SDD
operation: Freq
keyword: #p
keyword: freq=noraman
keyword: PBEPBE/SDD
title: #p freq=noraman PBEPBE/SDD
converged: YES YES NO NO
title: Mulliken charges:
elementType: O O O N N C C C C C C C C C C C C C C C C C C C C C C C C C H H H H H H H H H H H H H H H H H H H H H H H H
charge: -0.223079 -0.274776 -0.225937 -0.165714 -0.430742 -0.086874 0.356273 0.424025 0.288015 0.137923 0.081520 0.080264 -0.387950 0.095657 -0.583083 -0.394134 -0.575079 0.505666 -0.434950 -0.375447 -0.382897 0.490855 -0.219733 -0.396304 -0.226302 -0.393335 -0.395521 -0.663094 -0.665607 -0.635225 0.238691 0.233693 0.258671 0.260673 0.229397 0.251613 0.268935 0.231561 0.242381 0.233451 0.221819 0.224402 0.222447 0.231204 0.298484 0.243969 0.217572 0.213830 0.244160 0.215447 0.215307 0.227086 0.222263 0.228530
chargesum: 0.00000
title: Mulliken charges with hydrogens summed into heavy atoms:
elementType: O O O N N C C C C C C C C C C C C C C C C C C C C C C C C C
charge: -0.223079 -0.274776 -0.225937 -0.165714 -0.132258 -0.086874 0.356273 0.424025 0.288015 0.137923 0.081520 0.080264 -0.149258 0.095657 -0.349390 -0.135463 -0.314405 0.505666 -0.205553 -0.123834 -0.113962 0.490855 0.011828 -0.153924 0.007149 0.052885 0.058131 0.012277 0.009307 0.042654
polarizability: 4.33716191e+02 -5.80810796e+00 3.26999296e+02 -2.99810126e-01 1.22657914e+00 2.07623688e+02
1716.lowfreq: -7.2989 -4.8304 -3.4972 -0.0007 -0.0003 0.0003 16.7520 29.4360 40.4394
frequency: 16.6971 29.4145 40.4376 45.1877 50.4731 68.5646 76.6566 83.6048 96.6948 111.2931 123.0597 132.2409 148.8778 178.2042 184.6726 196.5014 211.3413 217.9722 223.6613 237.6493 241.1297 252.1034 268.9303 288.5492 317.0413 323.6644 329.5330 361.5661 375.7811 406.1043 407.4250 418.0136 433.6053 454.8582 461.5959 484.4390 490.4662 500.3506 536.4376 553.1300 563.5095 570.1567 571.5988 622.7957 628.2894 656.7743 662.4128 667.4481 688.9965 699.7366 713.5045 716.9472 734.2540 758.0273 766.9585 774.1417 782.3343 785.9655 786.2472 804.5384 811.4345 833.5675 837.5474 856.9981 870.2589 892.5124 920.9135 929.6399 937.5345 948.5891 956.0920 962.5649 972.4373 1000.2560 1004.9851 1019.7420 1034.8510 1071.2927 1073.3242 1077.1780 1084.5522 1094.8708 1110.2287 1115.3868 1124.4246 1156.0794 1164.7994 1168.7427 1171.3478 1192.6843 1201.7714 1206.2198 1222.0166 1234.0281 1253.4538 1270.1828 1274.1127 1284.3920 1289.9394 1297.7967 1338.1574 1339.8103 1350.0052 1365.4704 1377.3460 1384.4392 1387.5457 1398.9356 1404.7705 1419.4569 1445.1792 1448.0681 1451.5438 1461.3385 1465.8403 1466.0867 1467.1909 1477.2454 1483.2215 1490.7438 1492.1036 1498.6248 1502.4257 1513.2052 1525.1795 1554.1778 1593.7466 1604.2746 1616.8019 1636.8876 1645.3302 1671.2568 2937.5535 2983.2185 2983.4000 2988.8864 2994.9329 2999.2987 3037.8043 3043.4804 3078.8766 3079.1139 3092.1079 3092.4883 3093.8666 3120.3612 3131.7219 3133.0925 3144.7630 3151.4991 3156.0035 3168.6090 3172.2346 3172.4241 3181.2572 3594.8107
redmass: 3.9460 4.6368 5.5727 4.3933 4.1925 3.5439 3.6746 2.9964 4.0599 3.3725 3.7426 4.6623 3.2020 1.3554 2.5657 3.3948 1.4085 1.7773 1.9511 3.7483 4.2869 4.2965 4.7660 4.9792 2.9642 1.8859 1.9544 4.3996 5.1905 3.8241 4.1947 3.3979 3.7958 3.3426 3.3767 8.1768 4.0388 3.2226 3.1060 8.3988 4.8446 4.2987 4.0397 4.8134 6.9978 4.6858 5.2096 5.0126 7.2798 4.6140 4.2112 3.5805 5.1358 3.1491 3.7068 4.5212 1.2295 1.6721 1.1969 1.7608 1.5586 3.4951 1.9383 2.9899 1.7827 1.4373 2.2613 5.3647 1.3385 1.3765 2.8268 2.2690 1.9700 1.3299 3.7727 2.7217 3.1443 2.1709 2.1606 1.8183 2.4960 1.6721 1.8948 2.2304 1.2778 1.7444 1.6497 1.6589 1.3181 2.1544 2.3832 2.4764 2.1896 2.0483 2.1258 1.7995 1.5101 1.2617 1.9371 1.5108 2.3398 1.3267 1.3387 3.8903 2.9586 1.2135 1.3432 7.6602 2.7153 4.1337 1.4584 2.4616 2.5425 2.5818 1.0596 1.0434 1.0515 1.0818 1.0513 1.9720 1.0937 1.4692 1.2655 1.7877 2.6114 7.5443 6.6580 7.5859 7.3496 6.8110 7.0796 12.8779 1.0386 1.0356 1.0358 1.0603 1.0608 1.1002 1.1026 1.1021 1.0998 1.0995 1.0952 1.1009 1.1007 1.0907 1.0859 1.0888 1.0899 1.0873 1.0955 1.1003 1.0932 1.0964 1.0906 1.0774
irintensity: 0.6066 2.7998 1.0140 0.6295 1.6794 0.7730 0.1592 0.0122 2.4663 2.2762 1.1077 0.7575 1.1444 2.1342 0.3753 0.5043 2.0808 1.6379 0.2606 0.8631 1.9567 1.8055 2.5014 7.2381 3.2119 46.3158 51.7532 5.7576 7.8498 2.4964 5.7177 0.8968 5.8925 11.3812 3.1290 44.8347 1.2998 0.4535 6.3456 9.2264 0.8498 13.4707 7.9603 4.9761 16.7573 0.7185 1.8748 26.0375 11.4145 75.7964 6.5795 7.2569 22.5609 17.4075 118.5504 6.0731 9.5485 23.4834 20.8972 21.3178 43.0160 4.8959 51.1514 24.3843 17.1007 0.1666 4.2779 1.3602 0.8926 3.7748 5.1786 3.2478 0.3077 0.1294 106.2646 30.2525 84.1496 33.8139 10.5362 15.3765 51.1745 17.0669 13.8373 187.6919 1.4793 9.1382 2.5603 16.6433 11.1105 13.5388 39.3697 17.5096 304.9946 103.0738 47.9249 69.7792 4.9140 3.1340 49.6039 47.1411 34.6960 36.5036 104.5635 16.7765 71.6165 3.9422 52.7870 7.6744 38.2743 30.4526 89.5979 19.5429 15.4889 6.9602 9.6022 12.3030 15.8874 4.2605 0.3904 36.7526 34.6423 141.2023 7.4173 450.8779 113.1715 45.0531 56.9385 7.7328 13.6924 113.9844 555.5828 368.3585 140.4873 33.0730 27.6428 50.0910 58.5650 54.0867 5.3708 17.8696 21.6535 66.4881 28.5148 8.9429 86.4806 10.7396 1.2364 6.9882 7.9100 10.1511 10.5718 25.8559 20.7587 11.2274 7.3418 39.7880
temp: 298.150 k
press: 1.00000 atm
elementType: 8 8 8 7 7 6 6 6 6 6 6 6 6 6 6 6 6 6 6 6 6 6 6 6 6 6 6 6 6 6 1 1 1 1 1 1 1 1 1 1 1 1 1 1 1 1 1 1 1 1 1 1 1 1
symmnumber: 1
zpe: 1130886.9 jmol-1
zpe.correction: 0.430732 hartree
zpe.thermalcorrener: 0.457864 hartree
zpe.thermalcorrenthalpy: 0.458808 hartree
zpe.thermalcorrgfe: 0.372660 hartree
zpe.sumelectzpe: -1300.124043 hartree
zpe.sumelectthermal: -1300.096911 hartree
zpe.sumelectthermalent: -1300.095967 hartree
zpe.sumelectthermalfe: -1300.182115 hartree
dipole: 1.1878 -1.4449 -5.8934
dipole: 6.1831
quadrupole: -117.2608 -162.2254 -191.3090
quadrupole: 5.3724 9.7791 -14.5826
quadrupole: 39.6709 -5.2936 -34.3773 5.3724 9.7791 -14.5826
hfenergy: -1300.5547753 hartree
pointgroup: C01 [X(C25H24N2O3)]
dipole: 0.4546015 -0.3655709 -2.3616273 debye
polarizability: 433.7370801|-5.3187679|325.86995|-2.1698856|11.4530323|208.7321441 unknown
InChI: InChI=1S/C25H24N2O3/c1-4-27(5-2)17-11-12-20-23(15-17)29-22-13-10-16(26-3)14-21(22)25(20)19-9-7-6-8-18(19)24(28)30-25/h6-15,26H,4-5H2,1-3H3
charge 0 multiplicity 1
54 atoms
O  -0.965675 0.732142 1.919268
O  0.495826 -2.326935 0.151623
O  -1.852478 2.530513 3.120599
N  4.965978 -0.504619 -0.059209
N  -5.13165 -1.977974 -0.136891
C  -0.750351 0.352124 0.392606
C  0.724799 0.134952 0.188928
C  -1.553452 -0.913744 0.161015
C  -1.312323 1.59307 -0.297741
C  1.288064 -1.165042 0.13799
C  -1.779862 2.5278 0.645946
C  -0.908015 -2.173125 0.093501
C  1.642759 1.216599 0.139176
C  -1.570302 2.000932 2.025898
C  -2.962518 -0.87533 0.075176
C  -1.397858 1.866443 -1.675381
C  2.672203 -1.393267 0.045905
C  3.585151 -0.299366 0.014534
C  3.025937 1.025813 0.05611
C  -1.654165 -3.360008 -0.044113
C  -2.346359 3.75913 0.258756
C  -3.738514 -2.057695 -0.062223
C  -1.965494 3.099097 -2.079036
C  -3.056137 -3.312556 -0.118414
C  -2.436824 4.038905 -1.123172
C  5.911949 0.621235 -0.194201
C  5.550051 -1.85814 0.021502
C  6.323962 1.251518 1.157625
C  5.634437 -2.580313 -1.344598
C  -6.004507 -3.142935 -0.235128
H  1.254272 2.240187 0.187808
H  -3.47005 0.095487 0.132606
H  -1.033413 1.145767 -2.41476
H  3.003793 -2.431414 -0.017402
H  3.676577 1.903425 0.049426
H  -1.119944 -4.313727 -0.090568
H  -2.698179 4.465132 1.018141
H  -2.042053 3.334278 -3.146598
H  -3.619549 -4.244449 -0.219805
H  -2.870017 4.985438 -1.464397
H  6.812902 0.242644 -0.713053
H  5.478547 1.391271 -0.858864
H  6.565943 -1.762911 0.449532
H  4.970634 -2.466823 0.740405
H  -5.558871 -1.060564 -0.030353
H  5.445587 1.649355 1.694652
H  6.806215 0.500762 1.809476
H  7.040115 2.0793 0.998576
H  4.633029 -2.702526 -1.792147
H  6.254814 -2.004186 -2.054921
H  6.087286 -3.582398 -1.226348
H  -5.805562 -3.730918 -1.154415
H  -7.05396 -2.807184 -0.273165
H  -5.897148 -3.824668 0.634724
