program: Gaussian 09
title: 000091040
version: EM64L-G09RevD.01
frameworkgroup: C1[X(C26H29ClN2OS)]
method: RPBEPBE
basis: SDD
operation: Freq
keyword: #p
keyword: freq=noraman
keyword: PBEPBE/SDD
title: #p freq=noraman PBEPBE/SDD
converged: YES YES NO NO
title: Mulliken charges:
elementType: Cl S O N N C C C C C C C C C C C C C C C C C C C C C C C C C C H H H H H H H H H H H H H H H H H H H H H H H H H H H H H
charge: -0.061517 0.155121 -0.312588 -0.077937 -0.185786 -0.383741 -0.369991 -0.407084 -0.418711 -0.304982 0.338032 -0.659742 0.171635 -0.797941 -0.354270 -0.346224 0.509140 0.519823 -0.258161 -0.235985 -0.353767 -0.378016 -0.418765 -0.369016 -0.527322 -0.221779 -0.217099 -0.224916 -0.240398 -0.103638 -0.241176 0.182674 0.211357 0.209393 0.188070 0.221681 0.204577 0.268961 0.217737 0.218016 0.195633 0.271163 0.266362 0.282737 0.243823 0.245959 0.221277 0.227020 0.259710 0.246120 0.236215 0.272444 0.220383 0.226696 0.240237 0.254540 0.255162 0.228649 0.228948 0.231259
chargesum: 0.00000
title: Mulliken charges with hydrogens summed into heavy atoms:
elementType: Cl S O N N C C C C C C C C C C C C C C C C C C C C C C C C C C
charge: -0.061517 0.155121 -0.312588 -0.077937 -0.185786 0.010290 0.027472 0.019175 0.067986 0.108668 0.338032 -0.122217 0.171635 -0.515203 -0.110447 -0.100265 0.509140 0.519823 -0.036884 -0.008965 -0.094057 -0.131896 -0.182550 -0.096572 0.159994 0.032761 0.038063 0.003733 -0.011450 -0.103638 -0.009917
polarizability: 4.60561377e+02 3.05536786e+01 3.09136263e+02 -2.29708872e+01 2.39149241e+01 2.33605475e+02
1716.lowfreq: -4.9143 -0.0010 0.0009 0.0010 0.8027 4.9759 8.9109 12.5246 15.9085
frequency: 7.0779 11.0154 15.3678 20.0878 30.4903 37.6610 45.1752 56.8941 71.7102 73.5480 96.8733 103.2729 109.8059 115.6513 127.0801 153.9868 159.8563 168.9094 185.2285 204.9635 224.5373 235.3908 242.4152 270.6082 280.6739 308.5593 314.8391 319.6966 339.0777 349.3823 359.9185 384.0642 400.0118 404.1226 408.1837 415.9091 464.1289 483.4224 491.5171 498.8745 504.0480 538.4762 551.9924 576.0146 599.2149 612.7429 624.1495 627.7223 656.9458 685.8385 697.7456 702.6845 707.5448 736.4104 743.2731 754.4454 755.0062 769.4510 781.5609 789.6460 816.0870 825.5072 833.1201 847.4615 854.2495 856.8683 861.5038 918.6692 929.8055 932.7031 947.2744 950.2074 953.3985 968.3270 970.3175 983.9105 989.5364 999.4548 1000.0952 1002.8083 1005.2451 1027.0841 1040.5276 1050.4479 1056.9531 1065.4966 1072.9380 1079.4410 1090.2057 1098.7504 1108.6946 1112.4212 1128.5600 1140.8985 1150.7223 1157.5262 1169.0495 1171.2466 1172.1968 1176.5849 1181.3616 1186.1064 1187.9093 1200.7401 1209.8753 1213.5718 1237.0854 1250.6272 1265.0326 1266.9768 1274.9028 1293.6211 1299.3749 1303.1417 1327.7570 1339.7922 1346.3337 1350.7114 1365.9845 1373.8737 1374.6740 1382.8104 1385.4002 1393.6016 1396.5656 1417.5424 1437.2771 1442.5595 1452.2425 1456.4876 1459.2721 1459.3088 1463.8548 1470.0785 1475.1246 1479.3879 1479.7062 1481.6450 1488.6192 1571.3250 1585.4810 1589.9910 1597.1865 1608.6226 1609.7480 2847.3246 2853.6330 2873.7213 2903.5817 2925.3627 2964.3067 3009.4937 3021.6633 3025.6340 3032.5047 3048.2911 3050.2978 3057.5551 3082.3197 3099.8726 3112.3846 3117.6581 3122.4881 3127.8616 3134.9064 3135.4564 3143.6123 3146.1883 3151.6083 3155.7422 3163.7423 3168.9948 3170.1311 3173.9612
redmass: 6.2762 5.7008 4.8937 4.2584 6.2549 4.4817 6.7646 4.7676 3.4128 4.0753 2.8023 3.3514 4.6529 4.5768 3.8327 3.2793 4.3621 1.2636 4.7562 5.9770 4.8391 5.7966 2.7587 2.7917 3.4094 5.4761 2.6291 4.9529 4.1155 4.7040 3.9444 3.2288 4.6557 2.8553 2.8927 3.0856 4.1188 3.3453 3.4197 3.4883 3.6389 4.5760 4.7212 3.5844 6.0852 6.3237 3.0800 6.8217 5.4769 5.0412 3.7105 4.6027 1.7821 3.2592 3.6370 2.3089 1.3604 4.2064 1.8103 1.6889 3.2573 1.4917 1.5900 1.5197 1.5966 2.3114 1.3738 4.3108 1.4850 1.4435 2.1753 5.7453 1.3669 1.3168 1.3688 1.4376 5.1729 3.1402 1.4871 1.4591 2.3484 2.1884 2.1563 2.5213 1.9556 2.5230 2.7611 1.5978 2.1772 1.9972 1.3761 1.2699 2.1121 2.8458 1.3910 2.0736 1.1843 1.1578 1.2529 2.3134 2.4369 1.1157 1.1454 1.1666 1.7698 1.6137 1.6185 1.2198 1.3837 1.9194 1.3751 1.3226 1.3082 1.3325 1.3418 1.3102 1.5090 1.6861 1.8200 2.2625 6.4358 1.5785 6.3750 1.4250 2.7610 1.3217 2.1445 1.8583 1.0822 1.0695 1.0911 1.1103 1.0981 1.1172 2.3746 2.2825 1.0695 1.0896 2.6086 6.4798 7.4530 6.0229 6.2050 6.4642 6.1001 1.0712 1.0701 1.0694 1.0685 1.0700 1.0304 1.0851 1.0639 1.0813 1.0887 1.0908 1.0884 1.1040 1.0918 1.1086 1.1021 1.0870 1.0867 1.0850 1.0898 1.0910 1.0892 1.0958 1.0884 1.0937 1.1014 1.1004 1.0955 1.0968
irintensity: 0.0110 0.3354 0.3483 0.1488 0.1267 0.0049 0.2165 0.0370 0.1011 0.2819 5.9752 0.7635 0.9827 1.1293 0.3262 2.9361 5.0304 1.2959 0.0906 0.9799 0.8512 0.4041 7.7521 6.0373 2.8926 0.0049 14.8901 0.5206 2.9791 3.0392 1.8598 1.9787 15.5336 0.3871 0.2436 0.3776 2.6779 2.6046 5.4333 22.9048 20.5499 1.3799 2.0801 2.9106 8.8599 0.8863 1.6406 1.0206 8.5591 23.2455 7.2922 16.6587 54.0564 23.8308 5.0726 80.5855 75.4643 13.6750 8.1098 9.1731 5.8759 13.8718 15.6050 0.2198 0.3997 11.5273 3.0456 45.9267 3.6051 2.2062 11.6957 33.5979 0.4347 0.5583 0.1073 0.2377 1.0231 38.2185 14.1290 7.7064 52.1157 7.0191 26.2673 15.1735 6.5506 5.8465 43.6622 9.1118 17.1581 8.7300 7.3085 5.8819 91.1723 48.0494 2.8496 15.0936 7.6228 5.8042 6.6594 0.5914 39.1795 2.4919 0.5612 8.9478 2.1271 8.4766 134.3058 23.2734 1.9816 3.0244 8.4199 27.7440 0.8748 17.1225 1.6518 15.4700 3.5584 10.8603 14.3851 6.3922 0.4469 30.7011 0.4081 0.9110 6.8649 3.0742 13.7085 11.9044 1.4816 22.0873 22.3053 38.5788 11.9368 21.1779 89.6747 24.4491 5.3376 5.7037 139.2460 1.0784 4.3110 1.5581 11.6001 48.9909 6.2020 46.6251 72.4443 100.2342 72.4672 93.4994 67.1289 10.8274 14.6016 8.4420 52.9797 49.6404 24.3349 31.4950 6.1555 16.5511 23.8207 6.3067 0.1726 4.2689 7.6251 6.1277 14.3969 29.0966 1.9442 26.3616 27.8847 18.7590 6.6006 1.5146
temp: 298.150 k
press: 1.00000 atm
elementType: 17 16 8 7 7 6 6 6 6 6 6 6 6 6 6 6 6 6 6 6 6 6 6 6 6 6 6 6 6 6 6 1 1 1 1 1 1 1 1 1 1 1 1 1 1 1 1 1 1 1 1 1 1 1 1 1 1 1 1 1
symmnumber: 1
zpe: 1281049.7 jmol-1
zpe.correction: 0.487926 hartree
zpe.thermalcorrener: 0.517708 hartree
zpe.thermalcorrenthalpy: 0.518652 hartree
zpe.thermalcorrgfe: 0.420991 hartree
zpe.sumelectzpe: -2048.707936 hartree
zpe.sumelectthermal: -2048.678155 hartree
zpe.sumelectthermalent: -2048.677211 hartree
zpe.sumelectthermalfe: -2048.774871 hartree
dipole: 1.7254 0.2096 -0.1584
dipole: 1.7453
quadrupole: -233.3087 -186.7210 -190.3599
quadrupole: -15.2307 10.2462 7.2067
quadrupole: -29.8455 16.7422 13.1033 -15.2307 10.2462 7.2067
hfenergy: -2049.1958623 hartree
pointgroup: C01 [X(C26H29Cl1N2O1S1)]
dipole: 0.6763404 -0.1009874 0.0621852 debye
polarizability: 458.7695613|-35.0033606|309.4592187|23.4785605|25.2223784|235.074335 unknown
InChI: InChI=1S/C26H29ClN2OS/c1-30-25-10-6-5-9-24(25)29-17-15-28(16-18-29)19-20-31-26(21-7-3-2-4-8-21)22-11-13-23(27)14-12-22/h2-14,26H,15-20H2,1H3
charge 0 multiplicity 1
60 atoms
Cl -9.458695 1.782557 -0.560073
S  -2.524514 1.33475 -0.522219
O  5.715189 -1.624557 -1.059926
N  1.613526 1.375255 -0.064882
N  4.458188 0.80493 -0.04955
C  2.607725 2.386672 -0.497942
C  2.121659 0.012091 -0.362727
C  3.956778 2.170394 0.210874
C  3.463068 -0.23297 0.342669
C  0.260409 1.630796 -0.616588
C  5.832497 0.529612 0.200556
C  -0.826904 0.954157 0.237141
C  6.445922 -0.670303 -0.296389
C  -3.607491 0.179451 0.579217
C  6.66795 1.432902 0.919325
C  7.794151 -0.966708 -0.021609
C  -5.061305 0.542385 0.284584
C  -3.263428 -1.298009 0.417712
C  8.028432 1.146097 1.164433
C  8.597584 -0.064817 0.71289
C  -5.876121 -0.231878 -0.577886
C  -5.61568 1.704824 0.882355
C  -3.370336 -2.150746 1.546937
C  -2.878371 -1.860147 -0.825708
C  5.351896 -1.1555 -2.415336
C  -7.214038 0.139994 -0.841472
C  -6.949232 2.091142 0.632982
C  -3.10712 -3.534673 1.436053
C  -2.614229 -3.243529 -0.93934
C  -7.729623 1.297585 -0.230783
C  -2.72901 -4.086907 0.190349
H  2.776403 2.351353 -1.60517
H  2.227069 3.392977 -0.242226
H  1.392337 -0.737504 -0.008215
H  2.254456 -0.13339 -1.466135
H  4.684615 2.904514 -0.178684
H  3.821483 2.355181 1.30272
H  3.857525 -1.224235 0.070001
H  3.301652 -0.203263 1.444154
H  0.090969 2.724247 -0.61093
H  0.167851 1.291044 -1.678805
H  -0.711816 -0.1426 0.251929
H  -0.797325 1.341425 1.269035
H  -3.374498 0.491768 1.614155
H  6.242568 2.358007 1.32023
H  8.199037 -1.905901 -0.413356
H  8.635741 1.864133 1.727061
H  9.647428 -0.300313 0.91587
H  -5.474903 -1.139743 -1.03854
H  -4.993952 2.321517 1.541737
H  -3.666671 -1.729588 2.515846
H  -2.766106 -1.197659 -1.692023
H  6.266292 -0.968357 -3.010361
H  4.772182 -1.975321 -2.8675
H  4.7437 -0.23346 -2.361364
H  -7.840625 -0.46211 -1.505741
H  -7.371411 2.986797 1.097515
H  -3.192343 -4.178115 2.318922
H  -2.315527 -3.662125 -1.907193
H  -2.520005 -5.158928 0.103019
