program: Gaussian 09
title: 000091112
version: EM64L-G09RevD.01
frameworkgroup: C1[X(C24H26ClN3)]
method: RPBEPBE
basis: SDD
operation: Freq
keyword: #p
keyword: freq=noraman
keyword: PBEPBE/SDD
title: #p freq=noraman PBEPBE/SDD
converged: YES YES NO NO
title: Mulliken charges:
elementType: Cl N N N C C C C C C C C C C C C C C C C C C C C C C C C H H H H H H H H H H H H H H H H H H H H H H H H H H
charge: -0.064122 -0.078505 -0.147445 -0.108779 -0.361126 -0.336689 -0.364814 -0.387370 -0.394841 -0.447760 -0.348194 0.461524 0.513934 0.246850 -0.376550 -0.416319 -0.454648 -0.391605 -0.322696 -0.222948 -0.228459 -0.227938 -0.229733 -0.180972 -0.112937 -0.247300 -0.347381 -0.220422 0.210622 0.191429 0.202297 0.188942 0.189631 0.210260 0.205096 0.222662 0.199400 0.218763 0.208689 0.271439 0.216559 0.243996 0.255953 0.232389 0.240675 0.214962 0.253502 0.252367 0.226587 0.225262 0.228331 0.229461 0.230956 0.227016
chargesum: 0.00000
title: Mulliken charges with hydrogens summed into heavy atoms:
elementType: Cl N N N C C C C C C C C C C C C C C C C C C C C C C C C
charge: -0.064122 -0.078505 -0.147445 -0.108779 0.040925 0.054550 0.035077 0.030793 0.085287 -0.020002 -0.131635 0.461524 0.513934 0.246850 -0.132554 -0.160367 -0.222259 -0.150930 -0.107734 0.030554 0.023908 -0.001351 -0.004471 0.047359 -0.112937 -0.017838 -0.116425 0.006595
polarizability: 3.79737221e+02 2.64497792e+01 2.58746416e+02 2.58668028e+00 -1.95813261e+01 2.32538820e+02
1716.lowfreq: -10.9983 -0.5017 -0.0010 0.0003 0.0010 3.2116 8.0881 10.6876 23.4574
frequency: -7.9671 10.5137 23.3665 27.2686 35.3894 38.0890 46.3878 57.8288 69.6600 102.9558 130.5226 139.2332 159.8358 176.8020 182.3366 202.8946 240.0493 248.8150 255.4743 294.9617 297.9706 313.3300 343.8996 358.5971 401.6350 403.6772 405.6285 408.7582 410.0817 465.6545 468.9695 481.2182 494.4935 509.1999 532.6340 563.5494 589.4894 607.1606 616.1897 624.0424 628.0165 666.8053 706.4598 716.4427 726.8142 729.5099 743.9868 765.0345 767.9190 774.5031 803.0767 830.0893 837.2280 844.3817 846.2208 853.4748 857.1021 923.7768 926.4390 942.1618 943.0731 953.5886 954.8593 968.7097 975.8438 976.4079 989.5395 994.4158 998.5822 999.6775 1006.1047 1029.2759 1042.0195 1045.7801 1054.7026 1059.7096 1073.1055 1075.6729 1085.5548 1091.0491 1099.3023 1113.5272 1131.0066 1144.5762 1170.2879 1171.7527 1176.3471 1187.0541 1189.0903 1191.4700 1198.9976 1202.0896 1222.7396 1244.7443 1248.0018 1269.6114 1280.6053 1290.5376 1296.7693 1301.8485 1307.0648 1326.4042 1329.6072 1334.4436 1337.2520 1349.2087 1362.1913 1366.9102 1371.4635 1382.7596 1391.5058 1392.7466 1394.8282 1425.2039 1440.9322 1454.0447 1456.1498 1460.1181 1464.7116 1467.0899 1478.0157 1480.4045 1482.4570 1486.0277 1550.9717 1584.2686 1592.2841 1597.9883 1599.5770 1610.8642 2849.8420 2862.7571 2882.4554 2945.8711 2952.6243 2958.3722 2979.7145 3003.4098 3033.3431 3042.9807 3050.1921 3086.5716 3096.2838 3110.6866 3118.2426 3118.3839 3130.1656 3132.1481 3133.9488 3143.1925 3150.2275 3162.0602 3164.2759 3167.2328 3171.8156 3176.2138
redmass: 3.6548 5.9432 4.9148 4.0763 6.4410 4.2625 5.3851 3.3927 4.5157 5.0078 5.4088 5.9207 3.4724 4.3661 2.7839 3.4434 4.6005 2.1920 3.5970 2.8770 4.5311 4.3793 4.3492 3.4322 2.1217 2.9700 4.8502 3.0895 3.5300 3.2142 3.3986 3.2677 4.0232 2.8046 4.2391 3.4817 3.4240 3.4388 6.2398 3.5497 5.9856 4.7563 1.7139 4.0399 1.6991 4.4922 2.2861 2.6784 2.5238 2.3935 1.5026 1.2844 1.6759 1.5977 1.5369 1.2691 2.4069 1.5296 3.4954 1.6889 2.0827 2.1303 1.8649 1.3734 1.3216 1.3986 5.2310 1.3377 3.2846 3.0584 2.6934 1.9761 2.4449 2.0534 2.1796 2.1575 2.2887 2.8923 1.8031 1.7565 2.0530 1.4989 2.4707 2.6639 1.1796 1.0611 1.7050 1.1130 1.1821 2.6185 1.2769 1.8540 1.6091 1.4538 1.4027 1.4054 1.5054 1.3874 1.2749 2.0200 1.1987 1.4305 1.6427 1.3125 1.7744 1.5204 1.3839 1.3806 4.5349 7.0736 2.1189 2.0497 1.8783 2.1525 2.1572 1.0829 1.1193 1.1007 1.1209 1.1412 2.0908 1.7111 1.3687 2.8085 5.2382 7.3536 6.1103 6.0519 6.1035 6.1187 1.0712 1.0696 1.0683 1.0695 1.0693 1.0810 1.0623 1.0883 1.0895 1.0900 1.1008 1.0907 1.0921 1.0879 1.0893 1.0862 1.0895 1.0905 1.0885 1.0957 1.0876 1.1013 1.0925 1.0954 1.0967 1.1001
irintensity: 0.3780 0.0506 0.2084 0.2007 0.2916 0.1229 0.0225 0.8168 0.1330 1.0906 0.0242 1.1932 2.1662 0.1149 0.5293 3.6598 0.3406 1.1010 5.3936 6.7067 1.0908 3.4405 2.4832 0.8999 3.0188 1.4432 5.9940 0.6545 2.6320 3.2165 5.4228 17.4213 5.1970 8.6753 2.9956 29.2669 8.6483 3.9189 0.6183 2.5419 0.8735 11.4188 57.2790 4.8399 32.5958 0.8128 17.9822 40.7758 47.3193 21.1044 37.1036 1.7643 0.2317 2.1396 0.7568 1.1636 22.9727 5.4532 9.3929 2.6079 1.9411 45.2716 24.4922 0.2654 0.2270 0.0640 0.8365 0.2296 13.2126 99.0608 14.7593 2.9591 7.7245 0.1133 4.6215 8.3955 14.6260 27.6586 9.1402 1.3655 7.3243 15.3864 66.7613 17.5117 4.4045 0.0615 7.0939 0.6424 0.9189 0.7128 2.5993 0.0494 7.3256 49.9903 103.3422 21.2650 14.9292 15.7788 3.5096 15.0724 9.9201 3.0003 4.9970 5.3734 56.8275 7.6119 6.4841 22.2123 0.2206 0.9285 0.2695 1.2794 10.7536 32.2821 9.7743 2.2989 64.4596 34.9420 42.1373 8.7886 109.1696 4.6007 21.2891 199.5434 43.9254 4.5035 1.3350 398.8632 5.5127 8.6305 45.1460 53.8804 109.7044 44.7037 90.4240 10.8252 18.5694 16.9797 44.7319 56.0752 46.4783 21.0638 10.2047 9.9618 32.1662 4.5492 7.4015 8.4211 12.0625 37.1321 6.7651 26.0452 35.0870 8.3359 1.9546 15.7335
temp: 298.150 k
press: 1.00000 atm
elementType: 17 7 7 7 6 6 6 6 6 6 6 6 6 6 6 6 6 6 6 6 6 6 6 6 6 6 6 6 1 1 1 1 1 1 1 1 1 1 1 1 1 1 1 1 1 1 1 1 1 1 1 1 1 1
symmnumber: 1
zpe: 1166218.7 jmol-1
zpe.correction: 0.444189 hartree
zpe.thermalcorrener: 0.468392 hartree
zpe.thermalcorrenthalpy: 0.469336 hartree
zpe.thermalcorrgfe: 0.386327 hartree
zpe.sumelectzpe: -1552.429775 hartree
zpe.sumelectthermal: -1552.405572 hartree
zpe.sumelectthermalent: -1552.404628 hartree
zpe.sumelectthermalfe: -1552.487637 hartree
dipole: 0.6384 1.6770 1.0229
dipole: 2.0655
quadrupole: -200.0384 -170.8800 -162.6211
quadrupole: -11.4105 11.8323 -5.9202
quadrupole: -22.1919 6.9665 15.2254 -11.4105 11.8323 -5.9202
hfenergy: -1552.8739642 hartree
pointgroup: C01 [X(C24H26Cl1N3)]
dipole: 0.2013579 0.7128179 0.3342539 debye
polarizability: 374.2489092|36.1662334|260.4438562|-2.3837137|-22.7096829|236.3296923 unknown
InChI: InChI=1S/C24H26ClN3/c25-22-11-9-21(10-12-22)23(20-6-2-1-3-7-20)13-15-27-16-18-28(19-17-27)24-8-4-5-14-26-24/h1-12,14,23H,13,15-19H2
charge 0 multiplicity 1
54 atoms
Cl -7.367537 -3.460908 0.982796
N  1.290442 -0.31201 -0.825006
N  4.107925 -0.50232 -0.21464
N  6.266339 -0.020652 -1.021123
C  -0.038761 0.305066 -1.06983
C  1.788203 -0.084055 0.553447
C  2.31489 0.139971 -1.803666
C  3.102901 -0.854312 0.800003
C  3.626331 -0.636978 -1.605638
C  -1.184906 -0.494508 -0.417017
C  -2.589829 0.079369 -0.756706
C  -3.746667 -0.827979 -0.300083
C  -2.759114 1.507897 -0.21228
C  5.460098 -0.297469 0.061552
C  -5.073085 -0.486693 -0.678818
C  -3.55824 -1.993565 0.483168
C  -2.731986 2.625754 -1.082929
C  -2.923716 1.736483 1.178746
C  6.006098 -0.355434 1.387966
C  -6.177944 -1.27647 -0.29933
C  -4.652577 -2.798676 0.879729
C  -2.860137 3.941622 -0.580587
C  -3.047845 3.048181 1.685456
C  7.375312 -0.096798 1.571642
C  -5.94748 -2.427237 0.480324
C  -3.01588 4.15764 0.807284
C  7.587445 0.220974 -0.811258
C  8.200803 0.205031 0.45946
H  -0.070056 1.369087 -0.728695
H  -0.200709 0.316244 -2.16625
H  1.033738 -0.435704 1.279588
H  1.966618 1.005799 0.744508
H  2.520246 1.236568 -1.708225
H  1.935519 -0.050337 -2.824807
H  -1.058235 -0.514447 0.683431
H  -1.109626 -1.538628 -0.77536
H  3.468138 -0.602265 1.807824
H  2.89141 -1.945217 0.768234
H  3.442678 -1.709501 -1.830866
H  4.419946 -0.264701 -2.270873
H  -2.650307 0.146311 -1.864175
H  -5.246463 0.418252 -1.273302
H  -2.553863 -2.296315 0.793632
H  -2.610419 2.465641 -2.162032
H  -2.972909 0.881694 1.864478
H  5.387633 -0.607455 2.252834
H  -7.193729 -1.003564 -0.599796
H  -4.495544 -3.696928 1.484161
H  -2.838886 4.793547 -1.269734
H  -3.176914 3.20698 2.762249
H  7.799707 -0.139106 2.581199
H  -3.116578 5.175632 1.199856
H  8.173393 0.434585 -1.71384
H  9.269331 0.408004 0.570898
