program: Gaussian 09
title: 000093366
version: EM64L-G09RevD.01
frameworkgroup: C1[X(C10H20O2)]
method: RPBEPBE
basis: SDD
operation: Freq
keyword: #pfreq=noraman
keyword: PBEPBE/SDD
title: #p freq=noraman PBEPBE/SDD
converged: YES YES NO NO
title: Mulliken charges:
elementType: O O C C C C C C C C C C H H H H H H H H H H H H H H H H H H H H
charge: -0.269979 -0.263315 -0.434839 -0.032022 -0.346542 -0.174960 -0.208283 -0.686138 -0.218281 -0.206843 -0.675830 -0.681775 0.192837 0.209736 0.164774 0.217148 0.194669 0.215400 0.261540 0.218682 0.212914 0.207606 0.205862 0.179134 0.228167 0.175648 0.201117 0.223412 0.231847 0.201266 0.224980 0.232066
chargesum: 0.00000
title: Mulliken charges with hydrogens summed into heavy atoms:
elementType: O O C C C C C C C C C C
charge: -0.269979 -0.263315 -0.032266 0.132752 0.065275 0.040439 0.053258 -0.046935 0.166715 0.196972 -0.019454 -0.023462
polarizability: 1.54312912e+02 -3.57740305e+00 1.17422352e+02 -3.53950638e+00 1.82019323e+00 9.58704883e+01
1716.lowfreq: -11.9873 -6.8074 -0.0003 0.0000 0.0004 1.8256 28.1451 45.1146 50.3100
frequency: 28.0170 45.0501 50.2916 65.2200 66.8971 67.6409 95.2206 106.2587 159.5912 196.6831 229.2795 237.5408 243.2631 251.9111 259.7036 293.5634 332.9764 364.4681 436.7224 507.3980 536.5840 574.9802 738.7422 787.9053 809.9421 818.1266 851.5962 857.2996 872.7802 894.7772 920.7484 973.7088 1009.7727 1017.4686 1041.4371 1052.7155 1067.0178 1094.3711 1105.2749 1112.6545 1123.9662 1135.5851 1140.2387 1165.2525 1213.5302 1242.9144 1248.5755 1253.0107 1270.2018 1282.2901 1290.6431 1294.8564 1331.1329 1343.0826 1370.4557 1378.4787 1389.9999 1393.5764 1396.8341 1458.2145 1459.2811 1459.4812 1473.5259 1477.8760 1479.4417 1480.8482 1485.2606 1492.3957 1494.4764 1683.7762 2854.1796 2918.1535 2936.6873 2953.9984 2973.1298 2976.6731 2979.3031 2992.3054 2992.7244 3014.8825 3036.0066 3037.3163 3058.3814 3071.7067 3074.1437 3089.4078 3089.9052 3099.8752 3101.1887 3126.0493
redmass: 2.8969 2.4900 2.2993 1.7179 2.3812 2.0796 3.1601 2.8676 2.7259 2.5298 1.1451 1.3563 1.3403 2.2394 3.1989 2.4521 3.5376 3.7822 3.0702 3.0865 3.7478 4.0204 1.1160 2.0608 1.0979 1.0960 2.8457 2.1761 1.5440 1.8242 4.1545 1.1008 2.7454 2.1380 3.3613 2.4703 3.7468 2.0605 2.4968 2.0893 2.2704 1.4605 1.4615 2.4553 1.3799 1.1628 1.2779 1.1459 1.2340 1.2483 1.1578 1.1290 1.3294 1.4480 1.3359 1.3429 1.2132 1.2690 1.3340 1.0863 1.0412 1.0410 1.0605 1.0440 1.0487 1.0468 1.0743 1.0810 1.0802 6.6693 1.0832 1.0600 1.0656 1.0624 1.0361 1.0619 1.1006 1.0358 1.0359 1.0943 1.0961 1.0998 1.0922 1.1010 1.0992 1.0990 1.0987 1.1009 1.1012 1.0912
irintensity: 0.0802 0.2057 0.0576 0.3117 3.1574 2.3938 0.4910 2.9458 6.7322 1.7192 0.1548 0.4292 1.6292 0.6422 0.8245 5.7496 5.6414 2.6816 3.3481 0.7553 9.7377 0.8909 9.2876 11.9095 7.6005 5.1080 48.2639 8.6198 1.1543 11.3928 171.2668 60.7686 32.1842 35.9706 130.2906 3.4329 104.4281 15.9586 11.5541 8.6538 52.4794 12.6606 3.1842 12.5879 1.0081 4.0233 1.9820 2.3941 0.2893 13.4667 3.8559 31.6503 27.3045 8.0238 4.1830 10.8768 13.3983 16.3437 18.5736 3.7202 11.4810 9.6826 3.0298 12.5747 5.3872 8.0789 15.2939 5.3828 4.7720 19.9795 60.0556 59.9931 73.0935 22.3988 52.2540 25.2839 53.9856 36.3073 21.1770 3.8036 22.9165 9.2454 24.3801 93.0801 50.1177 36.1113 37.3127 37.7797 41.0717 10.3373
temp: 298.150 k
press: 1.00000 atm
elementType: 8 8 6 6 6 6 6 6 6 6 6 6 1 1 1 1 1 1 1 1 1 1 1 1 1 1 1 1 1 1 1 1
symmnumber: 1
zpe: 737263.4 jmol-1
zpe.correction: 0.280809 hartree
zpe.thermalcorrener: 0.296959 hartree
zpe.thermalcorrenthalpy: 0.297904 hartree
zpe.thermalcorrgfe: 0.235087 hartree
zpe.sumelectzpe: -542.464618 hartree
zpe.sumelectthermal: -542.448468 hartree
zpe.sumelectthermalent: -542.447524 hartree
zpe.sumelectthermalfe: -542.510340 hartree
dipole: -0.6532 1.1423 2.0475
dipole: 2.4339
quadrupole: -70.1484 -73.9463 -74.4584
quadrupole: -1.4616 3.6368 0.4884
quadrupole: 2.7026 -1.0952 -1.6074 -1.4616 3.6368 0.4884
hfenergy: -542.7454272 hartree
pointgroup: C01 [X(C10H20O2)]
dipole: 0.2642888 0.4268037 -0.8154256 debye
polarizability: 154.4130174|3.0089751|117.2386749|-3.5353502|-2.2735952|95.9540609 unknown
InChI: InChI=1S/C10H20O2/c1-4-7-8-9-10(11-5-2)12-6-3/h8-10H,4-7H2,1-3H3
charge 0 multiplicity 1
32 atoms
O  -1.7449 1.005782 0.321692
O  -1.533306 -1.336582 0.31367
C  2.992092 0.335357 0.317414
C  -0.899655 -0.131425 -0.139831
C  3.97946 -0.674634 -0.329962
C  1.593134 0.227417 -0.246564
C  0.475917 -0.067941 0.466155
C  5.422582 -0.503115 0.190318
C  -1.461513 2.263447 -0.38799
C  -2.863369 -1.57759 -0.292614
C  -2.450113 3.310574 0.126229
C  -3.362847 -2.917598 0.243541
H  3.385017 1.360439 0.145326
H  2.9712 0.182114 1.413893
H  -0.857762 -0.089653 -1.259101
H  3.623357 -1.703752 -0.130326
H  3.962795 -0.54509 -1.431213
H  1.501496 0.383772 -1.335275
H  0.513524 -0.243786 1.548877
H  6.108096 -1.234012 -0.276162
H  5.469797 -0.647507 1.286117
H  5.806329 0.510873 -0.031273
H  -0.413934 2.578907 -0.19616
H  -1.577499 2.111545 -1.485774
H  -3.539786 -0.746689 -0.019284
H  -2.758651 -1.599261 -1.400525
H  -2.278509 4.281644 -0.373683
H  -3.489601 2.994091 -0.068311
H  -2.330526 3.449593 1.214464
H  -4.358616 -3.151955 -0.175655
H  -2.666588 -3.730925 -0.024654
H  -3.445721 -2.882443 1.343462
