program: Gaussian 09
title: 000009600
version: EM64L-G09RevD.01
frameworkgroup: C1[X(C14H20FNO3)]
method: RPBEPBE
basis: SDD
operation: Freq
keyword: #p
keyword: freq=noraman
keyword: PBEPBE/SDD
title: #p freq=noraman PBEPBE/SDD
converged: YES YES NO NO
title: Mulliken charges:
elementType: F O O O N C C C C C C C C C C C C C C H H H H H H H H H H H H H H H H H H H H
charge: -0.210493 -0.275679 -0.245604 -0.197329 -0.110277 -0.384280 -0.328916 -0.327299 -0.260124 -0.667533 -0.669024 0.229961 -0.394559 0.350429 -0.293317 -0.333303 -0.372448 -0.338429 0.314010 0.220372 0.213297 0.207051 0.193692 0.208093 0.190758 0.244583 0.232811 0.208214 0.229161 0.209182 0.207445 0.229524 0.209397 0.239564 0.243301 0.251537 0.264307 0.253737 0.258190
chargesum: 0.00000
title: Mulliken charges with hydrogens summed into heavy atoms:
elementType: F O O O N C C C C C C C C C C C C C C
charge: -0.210493 -0.275679 -0.245604 -0.197329 -0.110277 0.049389 0.071826 0.071551 0.217269 -0.020976 -0.022658 0.229961 0.088306 0.350429 -0.041779 -0.068996 -0.118710 -0.080240 0.314010
polarizability: 2.41690457e+02 -4.80943408e-02 1.60757205e+02 1.55696610e+00 -1.21314043e+01 1.13189527e+02
1716.lowfreq: -4.4921 -0.5515 -0.0005 0.0002 0.0007 8.7399 10.5127 23.6792 24.6383
frequency: 9.4581 21.5677 24.5197 28.9829 47.1874 58.4187 68.1332 86.7814 102.5539 128.5274 154.5255 157.9169 176.5945 187.8201 215.8787 236.6844 268.1820 289.8591 305.5477 340.6250 353.7457 377.6871 409.8411 418.2530 445.2841 472.6553 490.6147 507.2834 510.5562 569.2495 627.3017 667.3821 704.5682 728.4335 753.9230 785.5652 795.0798 795.6078 799.7254 822.1314 828.2108 886.3451 913.7521 916.2356 925.8345 947.9374 991.8437 997.4822 1004.0650 1026.5363 1061.5199 1064.6788 1076.6868 1085.6712 1094.5310 1103.7362 1119.9148 1127.0976 1153.2649 1164.6917 1185.2456 1204.9199 1209.3160 1230.9442 1233.7373 1277.5953 1286.9614 1288.6092 1293.2955 1323.0249 1357.7254 1362.9207 1367.2218 1383.6139 1388.0868 1388.7726 1390.3586 1415.1235 1453.8623 1461.4865 1464.0377 1470.2582 1471.1701 1480.1994 1486.2982 1488.0872 1491.1458 1491.7101 1598.7410 1619.7467 1678.8070 2858.7001 2867.0449 2911.6238 2958.2932 2982.6004 2984.7933 3020.1682 3020.7285 3022.3857 3037.4052 3055.3567 3074.9160 3077.5283 3092.5561 3093.8104 3096.3564 3157.0709 3165.5682 3178.1454 3185.3199
redmass: 3.7145 5.8957 7.0946 4.6231 4.5835 3.1993 3.1570 2.0651 3.1619 2.6594 5.4486 3.9830 3.1636 1.7435 1.4965 2.5478 2.6118 2.2997 2.4951 4.2959 7.4740 4.1728 3.7808 3.0717 3.0096 2.9512 7.1493 2.5080 4.1288 3.4144 7.0252 6.0954 3.6814 4.6177 3.3117 1.1591 1.2764 1.1657 1.2447 5.6879 1.5970 6.9418 2.1093 1.3580 4.7526 1.3340 2.2391 2.7104 1.8731 6.6236 1.6955 2.6964 1.9194 2.1507 2.8870 1.2699 2.0505 2.6463 1.3586 1.4210 2.0973 1.1120 2.2070 1.7199 6.5451 1.1106 1.2082 1.2730 1.2486 1.3201 1.7561 1.3481 1.3875 2.6830 1.3016 1.2454 1.6377 3.7093 1.1227 1.0591 1.0521 1.0645 1.0618 1.0539 1.0711 1.0734 2.3905 1.0829 7.5306 6.8693 10.9188 1.0719 1.0713 1.0706 1.0569 1.0358 1.0358 1.0998 1.0721 1.0755 1.0877 1.0897 1.0984 1.0983 1.1004 1.1005 1.1087 1.0881 1.0887 1.0967 1.0980
irintensity: 0.4665 0.1268 0.2679 0.0348 0.2870 0.2011 0.1128 0.1330 0.7446 3.9946 4.1568 4.3632 5.9800 2.2810 0.8065 1.3531 10.1033 3.4717 5.4587 0.1670 0.0139 1.7025 18.6295 0.1799 9.7823 3.5481 2.3329 20.8453 1.8621 4.0988 0.0387 6.2145 0.1610 42.9426 25.5548 6.4150 10.9305 3.4588 3.9902 1.1777 94.9827 5.8714 2.7024 0.3056 45.4880 0.2272 4.7678 6.5627 0.2957 190.7642 28.5079 55.0662 23.2327 2.7457 4.7766 36.7469 207.8747 416.7597 22.6460 14.0637 118.4620 14.1571 24.3081 26.4239 69.1668 1.1320 7.6281 1.2608 26.8734 4.4178 16.2897 1.8722 12.0586 1.2714 20.2437 20.4224 2.4133 1.8757 87.7776 2.2695 8.7959 1.2504 7.4933 6.2629 13.0692 14.7081 237.5336 17.1793 5.9085 6.0600 187.9637 34.4779 161.6402 83.8220 40.5321 30.4597 29.2244 18.1985 26.0039 10.5356 14.0982 13.2702 46.2646 70.8369 32.7323 49.9744 29.6856 13.6034 2.5561 3.8073 0.7971
temp: 298.150 k
press: 1.00000 atm
elementType: 9 8 8 8 7 6 6 6 6 6 6 6 6 6 6 6 6 6 6 1 1 1 1 1 1 1 1 1 1 1 1 1 1 1 1 1 1 1 1
symmnumber: 1
zpe: 834503.4 jmol-1
zpe.correction: 0.317846 hartree
zpe.thermalcorrener: 0.338645 hartree
zpe.thermalcorrenthalpy: 0.339589 hartree
zpe.thermalcorrgfe: 0.263356 hartree
zpe.sumelectzpe: -924.248517 hartree
zpe.sumelectthermal: -924.227717 hartree
zpe.sumelectthermalent: -924.226773 hartree
zpe.sumelectthermalfe: -924.303007 hartree
dipole: 4.1711 2.4498 -1.6140
dipole: 5.0995
quadrupole: -120.2846 -111.6466 -115.8138
quadrupole: 4.8205 -5.0730 2.3585
quadrupole: -4.3696 4.2684 0.1012 4.8205 -5.0730 2.3585
hfenergy: -924.5663623 hartree
pointgroup: C01 [X(C14H20F1N1O3)]
dipole: -1.6398605 0.8491751 0.7841709 debye
polarizability: 241.5843306|-1.8600556|154.4830453|3.6043254|20.1293028|119.5698133 unknown
InChI: InChI=1S/C14H20FNO3/c1-3-16(4-2)9-10-18-14(17)11-19-13-7-5-12(15)6-8-13/h5-8H,3-4,9-11H2,1-2H3
charge 0 multiplicity 1
39 atoms
F  7.398064 0.61086 0.643821
O  -1.375453 0.258943 0.021564
O  2.066871 -0.72994 -0.450212
O  -0.46961 -1.376174 -1.384431
N  -5.121906 0.263192 0.16357
C  -3.727876 0.621844 0.517542
C  -5.60451 -0.958894 0.863816
C  -6.070582 1.405967 0.234315
C  -2.758608 -0.120757 -0.409585
C  -6.69166 -1.714648 0.076476
C  -5.901968 2.396783 -0.933062
C  -0.326262 -0.4463 -0.571521
C  0.981361 0.155328 -0.061717
C  3.373642 -0.315599 -0.133021
C  3.696396 0.877566 0.560866
C  4.397501 -1.196632 -0.563965
C  5.051914 1.188366 0.821391
C  5.746319 -0.890118 -0.305223
C  6.045264 0.300947 0.384111
H  -3.580146 1.708167 0.386656
H  -3.480311 0.389709 1.579599
H  -4.738196 -1.633415 1.000555
H  -5.978591 -0.716158 1.890499
H  -7.094463 0.992332 0.197735
H  -5.983505 1.949272 1.20917
H  -2.901772 0.180911 -1.46131
H  -2.862651 -1.21812 -0.341478
H  -7.596103 -1.098152 -0.074737
H  -6.30845 -2.00478 -0.917095
H  -6.997235 -2.627548 0.620889
H  -4.895894 2.854879 -0.944191
H  -6.04996 1.877484 -1.895728
H  -6.640241 3.216438 -0.853625
H  1.103311 1.163118 -0.51181
H  0.921008 0.273642 1.038484
H  2.920552 1.567288 0.904888
H  4.114224 -2.107823 -1.097978
H  5.330162 2.102046 1.354378
H  6.552661 -1.554025 -0.629135
