program: Gaussian 09
title: 000093323
version: EM64L-G09RevD.01
frameworkgroup: C1[X(C6H10Cl4O)]
method: RPBEPBE
basis: SDD
operation: Freq
keyword: #p
keyword: freq=noraman
keyword: PBEPBE/SDD
title: #p freq=noraman PBEPBE/SDD
converged: YES YES NO NO
title: Mulliken charges:
elementType: Cl Cl Cl Cl O C C C C C C H H H H H H H H H H
charge: -0.050482 -0.071711 -0.050505 -0.071705 -0.258227 0.085409 0.085494 -0.612091 -0.583856 -0.612059 -0.583909 0.235242 0.235249 0.298646 0.258351 0.266430 0.303185 0.298625 0.258345 0.266398 0.303171
chargesum: 0.00000
title: Mulliken charges with hydrogens summed into heavy atoms:
elementType: Cl Cl Cl Cl O C C C C C C
charge: -0.050482 -0.071711 -0.050505 -0.071705 -0.258227 0.320651 0.320743 -0.055095 -0.014241 -0.055088 -0.014340
polarizability: 1.04383278e+02 7.35144983e+00 9.88706938e+01 6.39480921e-03 -1.41367961e-02 1.02000433e+02
1716.lowfreq: -10.0044 -6.3874 -0.0025 -0.0004 0.0013 7.6500 33.0804 43.8024 46.0671
frequency: 32.9893 43.7809 46.0205 78.1150 84.3117 102.0514 105.2835 143.5609 196.2289 228.0305 261.5073 274.6762 347.6564 380.7343 431.0859 532.5837 536.8090 622.4504 626.8104 690.6164 727.0317 777.0666 856.5015 859.8557 914.9683 939.2544 980.9338 1016.7833 1044.3957 1066.6289 1067.3224 1161.0938 1174.9757 1186.1379 1189.3180 1227.3380 1244.2586 1273.4371 1276.7392 1306.1896 1316.7842 1318.1840 1365.2593 1426.2476 1427.3139 1433.8300 1435.4481 2969.7028 2971.5506 3061.6220 3061.6973 3068.0999 3068.1073 3153.3904 3153.5414 3165.2543 3165.4422
redmass: 15.4407 10.5243 15.3548 4.8910 12.3257 3.6497 5.2037 12.0018 5.5059 7.7780 5.1796 2.5329 2.7099 2.9581 3.3692 5.8412 4.5284 5.5200 6.3551 4.1385 5.0789 2.6894 1.7499 1.6402 2.6053 2.0862 1.9738 2.2873 3.0411 1.6583 1.6394 1.2960 1.2967 1.3025 1.3070 1.2286 1.2277 1.2483 1.2905 1.1649 1.3613 1.3720 1.2645 1.0968 1.0933 1.0990 1.0994 1.0843 1.0826 1.0582 1.0582 1.0580 1.0580 1.1096 1.1097 1.1094 1.1092
irintensity: 0.5280 2.4043 0.6458 9.1130 1.0592 6.6417 0.8956 1.8446 2.9419 3.5377 0.8691 2.6896 0.8506 1.7941 29.2588 8.2692 31.9103 9.8864 27.9009 24.3155 26.0129 6.8636 10.0442 0.8814 25.5757 23.4460 0.0132 20.6340 134.9187 3.2882 1.9918 34.7882 0.8620 24.8803 0.0072 0.9013 1.3179 0.8818 30.9473 40.7213 4.0261 3.5303 9.3722 1.0832 25.6685 21.2454 0.4443 7.1538 11.0880 11.8123 11.3281 14.3221 14.0709 2.0987 4.2925 6.4658 2.4726
temp: 298.150 k
press: 1.00000 atm
elementType: 17 17 17 17 8 6 6 6 6 6 6 1 1 1 1 1 1 1 1 1 1
symmnumber: 1
zpe: 404439.5 jmol-1
zpe.correction: 0.154043 hartree
zpe.thermalcorrener: 0.167648 hartree
zpe.thermalcorrenthalpy: 0.168592 hartree
zpe.thermalcorrgfe: 0.110280 hartree
zpe.sumelectzpe: -2149.196363 hartree
zpe.sumelectthermal: -2149.182758 hartree
zpe.sumelectthermalent: -2149.181814 hartree
zpe.sumelectthermalfe: -2149.240125 hartree
dipole: 0.0018 0.0005 -3.0064
dipole: 3.0064
quadrupole: -89.3649 -98.7065 -101.5740
quadrupole: 2.1831 -0.0078 0.0033
quadrupole: 7.1836 -2.1580 -5.0256 2.1831 -0.0078 0.0033
hfenergy: -2149.3504054 hartree
pointgroup: C01 [X(C6H10Cl4O1)]
dipole: -0.0012509 0.0008091 -1.1828241 debye
dipolederiv: -0.2636734 -0.0137741 0.1365657 0.0099082 -0.2132525 -0.0355382 0.1961444 0.0069124 -0.4287996 -0.3210574 -0.1190973 0.0890358 -0.0715985 -0.4247005 0.1389931 0.0798744 0.1790294 -0.2806823 -0.2638471 -0.0137599 -0.1366826 0.0099905 -0.2132762 0.0354681 -0.1962717 -0.0069904 -0.4287421 -0.3207248 -0.1190762 -0.0890189 -0.0714471 -0.4247938 -0.1391075 -0.0797574 -0.1791123 -0.28074 -1.2789013 0.1968382 0.0001541 0.0598275 -0.4646328 -0.0001884 0.0003072 -0.0001012 -0.2630935 0.7998743 -0.2534512 0.1623957 -0.0429418 0.2598407 -0.0627455 0.4031585 -0.0271131 0.0430989 0.7998186 -0.2531715 -0.1626753 -0.0421423 0.2596199 0.0629412 -0.4033102 0.0273726 0.0432335 0.2297687 0.0701925 -0.2316014 -0.0791725 0.0583771 0.1071341 -0.2748405 0.0908838 0.6106909 0.2122491 0.2371697 -0.14852 0.2351295 0.3378238 -0.2104504 -0.1677198 -0.2389349 0.3240095 0.2298629 0.0702606 0.2318414 -0.0792186 0.0582906 -0.1070561 0.2750399 -0.0909393 0.6104188 0.2119224 0.2370649 0.1484507 0.2348447 0.338164 0.2105515 0.1674375 0.239017 0.3241563 -0.0219963 0.0107538 0.0852774 -0.0549618 0.0606513 0.001646 -0.0352106 -0.0484013 -0.0752056 -0.0219894 0.0107034 -0.085299 -0.0551347 0.0607437 -0.0016324 0.0350199 0.0483884 -0.0750968 0.0884537 0.0517605 0.0314111 0.0454306 -0.0266178 0.00507 0.0364768 0.0113749 -0.0058463 -0.075009 -0.0219065 -0.0269979 -0.0067027 0.1096243 -0.0198115 -0.0344213 -0.039532 -0.0804972 -0.0999489 -0.0129123 -0.0320208 -0.0238536 0.0352651 0.0321878 -0.0436324 0.0431047 0.0464255 0.090816 -0.0471714 0.0208054 -0.0413019 0.0353348 0.0319821 0.0348562 -0.0301578 -0.0216703 0.0884166 0.0517497 -0.0313413 0.0454677 -0.0265298 -0.0051898 -0.0363504 -0.0114864 -0.0058285 -0.0749908 -0.0220116 0.0269848 -0.0068955 0.1095974 0.019897 0.0344204 0.0396132 -0.0804928 -0.0999045 -0.0130534 0.0320776 -0.0240029 0.035215 -0.0321716 0.0437115 -0.0430836 0.0463461 0.0908604 -0.0471078 -0.0208423 -0.041225 0.0352556 -0.0319794 -0.0349323 0.0301558 -0.0216843 unknown
polarizability: 106.4399677|6.2029213|96.8139842|-0.0015121|0.00835|102.0004531 unknown
InChI: InChI=1S/C6H10Cl4O/c7-1-5(2-8)11-6(3-9)4-10/h5-6H,1-4H2
charge 0 multiplicity 1
21 atoms
Cl -2.89794 -0.486244 1.692631
Cl -0.774354 2.59956 -1.637781
Cl 2.897232 0.487058 1.691681
Cl 0.775175 -2.599655 -1.639064
O  -0.000384 -0.000917 0.191822
C  -1.251832 0.035187 -0.580625
C  1.250815 -0.035358 -0.581128
C  -2.220188 -0.998358 0.00704
C  -1.837867 1.450906 -0.571207
C  2.218492 0.998885 0.006399
C  1.838074 -1.450609 -0.572374
H  -1.063897 -0.285684 -1.627755
H  1.062204 0.28563 -1.628091
H  -1.697631 -1.951211 0.167229
H  -3.105607 -1.130687 -0.633593
H  -2.845887 1.491453 -1.011389
H  -1.825013 1.882531 0.438091
H  1.695258 1.951309 0.166934
H  3.103578 1.132061 -0.634527
H  2.845996 -1.490172 -1.012874
H  1.825876 -1.882585 0.436781
