program: Gaussian 09
title: 000093282
version: EM64L-G09RevD.01
frameworkgroup: C1[X(C4H5BrO2)]
method: RPBEPBE
basis: SDD
operation: Freq
keyword: #p
keyword: freq=noraman
keyword: PBEPBE/SDD
title: #p freq=noraman PBEPBE/SDD
converged: YES YES NO NO
title: Mulliken charges:
elementType: Br O O C C C C H H H H H
charge: 0.041549 -0.209742 -0.189722 0.007471 -0.171495 -0.512910 -0.079127 0.226535 0.236661 0.234173 0.260989 0.155618
chargesum: 0.00000
title: Mulliken charges with hydrogens summed into heavy atoms:
elementType: Br O O C C C C
charge: 0.041549 -0.209742 -0.189722 0.234006 -0.171495 0.218913 0.076491
polarizability: 1.07026275e+02 -1.47059030e+00 7.41512273e+01 3.75563965e-02 -1.84532159e-02 2.99543160e+01
1716.lowfreq: -5.5405 -0.0007 0.0003 0.0008 5.1621 6.8632 57.5947 105.1820 115.6504
frequency: 57.5894 105.1801 115.6459 163.7888 164.7365 306.9219 332.9191 431.3064 431.4644 525.4365 684.3789 837.5032 911.3782 944.4759 1106.9237 1109.3609 1168.3865 1205.1487 1300.7346 1386.3691 1433.4341 1459.1892 1469.9915 1608.9463 1628.2804 2841.0986 2984.7831 3071.6665 3085.8693 3148.2314
redmass: 1.4171 2.5314 5.8349 3.1115 11.5070 4.1960 2.5817 7.5728 3.4160 5.7894 6.0638 1.4260 7.7778 1.7239 1.4885 1.5372 3.5119 3.9555 1.2783 1.1839 1.1642 1.0501 1.0497 8.8288 5.9786 1.0827 1.0315 1.0897 1.1058 1.1016
irintensity: 1.5790 0.9425 0.5723 18.8930 4.3610 7.4249 1.3294 4.3729 24.4644 42.4077 2.5126 15.9242 33.1693 3.9230 71.5179 75.8089 59.9671 262.9712 47.6078 11.3176 6.2217 32.1786 16.4333 265.3826 276.6929 100.3005 68.9072 13.6972 35.1303 10.6605
temp: 298.150 k
press: 1.00000 atm
elementType: 35 8 8 6 6 6 6 1 1 1 1 1
symmnumber: 1
zpe: 215454.3 jmol-1
zpe.correction: 0.082062 hartree
zpe.thermalcorrener: 0.090351 hartree
zpe.thermalcorrenthalpy: 0.091295 hartree
zpe.thermalcorrgfe: 0.047228 hartree
zpe.sumelectzpe: -318.735355 hartree
zpe.sumelectthermal: -318.727066 hartree
zpe.sumelectthermalent: -318.726122 hartree
zpe.sumelectthermalfe: -318.770190 hartree
dipole: 7.1917 1.3574 0.0046
dipole: 7.3186
quadrupole: -43.9650 -48.1921 -50.9979
quadrupole: 9.5780 0.0228 -0.0083
quadrupole: 3.7533 -0.4738 -3.2795 9.5780 0.0228 -0.0083
hfenergy: -318.817417 hartree
pointgroup: C01 [X(C4H5Br1O2)]
dipole: -2.5567869 1.3070149 -0.2129019 debye
dipolederiv: -0.0148046 0.0280273 -0.0034832 0.09517 -0.5074022 0.0163525 -0.0046938 0.0114227 0.0258539 -1.9156166 0.2117088 -0.1275539 -0.6982672 -0.1735118 -0.0540011 -0.0967359 0.0108962 -0.2780936 -1.2456058 -0.1419416 -0.0649839 0.115992 -0.3069762 0.0081131 -0.0686854 -0.0105853 -0.3316341 1.6997248 -0.0765565 0.1246109 0.7166078 -0.1313005 0.0563891 0.1036446 -0.0006064 0.0238878 -1.1863424 -0.2898397 -0.0672359 -0.4392462 0.7629838 -0.0493669 -0.0643322 -0.0376979 -0.2102329 0.9704383 -0.2013675 0.0577691 -0.3210312 0.2919474 -0.021277 0.0525323 -0.0129096 0.3263257 1.7057402 0.337351 0.1095814 0.3414675 0.4384509 0.0200689 0.1086467 0.0189899 0.1386855 0.0472133 0.0553974 -0.0118207 -0.0298419 -0.1048525 0.002987 -0.0098392 0.0081928 0.1987322 -0.0164927 0.0045805 0.0272471 0.1402727 0.0127841 0.1135072 -0.0532807 0.1100328 -0.0823202 -0.0167409 0.0128626 -0.0273523 0.1538179 -0.0127653 -0.1030706 0.0448268 -0.1167164 -0.0547999 -0.0423082 -0.0518455 -0.0075882 -0.1088531 0.0177477 0.0009764 -0.0041523 0.0039336 0.1284736 0.0147945 0.1116231 -0.0091904 0.0339118 -0.2871054 0.0093214 -0.0079309 0.0150474 0.115122 unknown
polarizability: 104.7946606|-7.5425806|75.938109|5.6808524|-1.3552053|30.3990484 unknown
InChI: InChI=1S/C4H5BrO2/c1-7-3-4(5)2-6/h2-3H,1H3
charge 0 multiplicity 1
12 atoms
Br 0.811054 -1.972565 0.0837
O  -1.857429 -0.268437 -0.138536
O  2.914652 0.486818 0.194432
C  -0.717621 0.488037 -0.069908
C  0.540516 -0.0547 0.030711
C  -3.132701 0.473728 -0.25233
C  1.709808 0.834875 0.100726
H  -0.828829 1.584523 -0.096597
H  -3.163181 1.043957 -1.198257
H  -3.267406 1.148227 0.612627
H  -3.914429 -0.297892 -0.252651
H  1.423768 1.919629 0.061483
