program: Gaussian 09
title: 000093335
version: EM64L-G09RevD.01
frameworkgroup: C1[X(C18H24N2)]
method: RPBEPBE
basis: SDD
operation: Freq
keyword: #pfreq=noraman
keyword: PBEPBE/SDD
title: #p freq=noraman PBEPBE/SDD
converged: YES YES NO NO
title: Mulliken charges:
elementType: N N C C C C C C C C C C C C C C C C C C H H H H H H H H H H H H H H H H H H H H H H H H
charge: -0.272649 -0.700721 -0.082653 -0.406383 -0.024177 -0.738843 -0.722765 -0.707485 0.326760 0.363420 -0.351038 -0.296088 -0.361519 -0.384669 -0.426845 -0.432099 0.511449 -0.231385 -0.236931 -0.279045 0.209057 0.206851 0.222323 0.191352 0.227974 0.223814 0.227241 0.221492 0.213165 0.205934 0.213159 0.204369 0.211074 0.251206 0.245108 0.249443 0.234674 0.217135 0.216300 0.214837 0.214606 0.220996 0.305697 0.305858
chargesum: 0.00000
title: Mulliken charges with hydrogens summed into heavy atoms:
elementType: N N C C C C C C C C C C C C C C C C C C
charge: -0.272649 -0.089166 0.126404 0.022791 0.167176 -0.059813 -0.082174 -0.078883 0.326760 0.363420 -0.099832 -0.050980 -0.112075 -0.149995 -0.209710 -0.215799 0.511449 -0.016548 -0.022325 -0.058049
polarizability: 2.67216071e+02 -2.29081162e+01 2.21494731e+02 -2.59394683e+00 -1.88195411e+00 1.51228687e+02
1716.lowfreq: -16.8034 -5.5790 -0.0009 -0.0005 0.0002 3.2739 8.8054 26.5071 43.5503
frequency: -13.6536 26.3374 43.5382 50.7680 56.5354 68.2289 107.6648 140.0806 170.2249 185.0361 190.3852 202.8349 222.7464 235.1268 260.1779 300.6000 313.2327 350.4837 353.4576 363.6456 375.9345 378.7440 380.4509 410.6106 420.0582 425.4336 452.2590 472.1994 516.8554 531.9955 556.8203 613.0304 618.7244 640.6747 684.9204 689.9598 737.9180 749.3980 777.1133 812.1518 816.0957 817.9948 825.6540 841.1331 869.8648 871.8512 886.0776 913.2663 939.2820 954.1467 955.8853 959.9397 969.5138 972.6302 973.4109 976.8424 999.0146 1015.6325 1026.3681 1032.0240 1054.5323 1091.8717 1117.5078 1121.4630 1141.2649 1163.3465 1169.2828 1178.2553 1195.5329 1197.6309 1226.9368 1248.4476 1286.1941 1294.8757 1308.9610 1315.7588 1317.4990 1332.3882 1345.7803 1357.0712 1364.3834 1367.5792 1375.4926 1385.9209 1392.5049 1394.1888 1431.3783 1447.2737 1459.6865 1461.3619 1469.1315 1471.7664 1480.9348 1486.0450 1487.3588 1495.7513 1513.5499 1572.5168 1573.9797 1615.6748 1629.2462 1644.4514 2945.4443 2966.2489 2968.4574 2974.9632 2995.7617 3002.8588 3023.6128 3058.5286 3065.3743 3067.2690 3074.1101 3087.5606 3111.6419 3116.4736 3116.9532 3119.0862 3124.2838 3147.4078 3153.1696 3153.6038 3163.8305 3172.1642 3567.8543 3707.8656
redmass: 2.9121 3.4306 4.0613 4.3635 3.6953 3.8475 2.3311 2.7953 4.0486 1.4005 4.1082 1.5518 3.8503 1.1991 1.4906 4.7432 2.0685 2.0836 1.5632 2.3860 1.0583 2.7298 2.6853 2.8762 2.7333 2.5225 3.8767 2.8819 3.0504 2.6153 4.6741 4.8186 3.7573 6.7916 3.9369 1.9295 3.7073 1.8429 3.2607 1.2786 1.3570 3.6398 1.8882 1.9538 1.5223 2.0917 2.2680 1.1910 1.4741 1.3588 1.4078 1.3571 2.6236 1.5209 1.6518 3.7578 2.6975 1.4425 1.6812 1.9831 2.1478 1.5775 1.7187 1.3069 2.1097 2.0026 1.0839 1.1297 1.1890 2.0064 2.7876 1.3308 1.4343 1.3945 2.4106 1.4883 1.8326 1.4340 1.4654 1.5724 1.9304 3.6365 1.2920 2.3897 1.3014 1.2533 3.5269 2.5613 1.1004 1.0525 1.0519 1.0531 1.0556 1.1622 1.9565 1.0557 3.1560 6.8767 6.1179 5.9391 3.0374 1.4669 1.0776 1.0569 1.0409 1.0384 1.0375 1.0838 1.1006 1.0990 1.0996 1.0992 1.0990 1.0997 1.0962 1.0887 1.0846 1.0881 1.0894 1.0954 1.0938 1.0959 1.0940 1.0961 1.0449 1.1040
irintensity: 0.0088 0.2556 0.6499 0.5532 0.6586 0.6356 0.1343 1.1135 1.3865 0.1592 0.1396 0.6052 1.7102 0.1121 0.1738 1.4036 0.4336 50.0662 154.9078 82.1880 0.9344 9.2386 11.5597 0.3127 0.0349 2.2245 12.9950 4.0880 8.2902 11.8280 10.6994 4.2521 13.5349 0.8998 1.0432 33.2487 7.9935 76.5777 8.5021 0.3324 1.9626 2.1858 44.7632 4.9105 3.9156 4.5106 4.8290 1.5586 1.4224 0.2872 0.3227 0.1539 2.9748 2.9248 2.6122 4.0109 3.4053 0.0360 11.4147 8.5823 13.3818 3.4135 39.6696 21.4315 9.0240 3.5127 1.1044 29.1528 8.7028 18.0877 44.7997 11.3019 77.4376 7.9124 116.1457 3.9449 4.0294 0.8872 11.8791 8.8196 6.0100 5.3628 11.1368 21.8381 7.0915 33.7764 0.6608 1.3178 1.4841 6.8365 13.3687 7.6285 1.1266 40.8316 156.6429 29.1298 232.0853 3.0371 6.2795 158.0211 24.0851 275.4924 17.7872 48.3299 24.5085 19.3641 24.6330 18.9933 34.7985 13.4003 55.1665 96.3270 44.7538 29.8261 41.3958 10.7991 9.5716 35.8621 20.9895 20.1928 39.4202 3.9012 27.5476 5.7017 81.5275 20.7019
temp: 298.150 k
press: 1.00000 atm
elementType: 7 7 6 6 6 6 6 6 6 6 6 6 6 6 6 6 6 6 6 6 1 1 1 1 1 1 1 1 1 1 1 1 1 1 1 1 1 1 1 1 1 1 1 1
symmnumber: 1
zpe: 989145.9 jmol-1
zpe.correction: 0.376746 hartree
zpe.thermalcorrener: 0.396312 hartree
zpe.thermalcorrenthalpy: 0.397256 hartree
zpe.thermalcorrgfe: 0.328835 hartree
zpe.sumelectzpe: -808.325155 hartree
zpe.sumelectthermal: -808.305589 hartree
zpe.sumelectthermalent: -808.304645 hartree
zpe.sumelectthermalfe: -808.373066 hartree
dipole: 3.0684 -2.9151 -0.5046
dipole: 4.2623
quadrupole: -91.6152 -126.0627 -118.7765
quadrupole: -2.1459 -1.8493 1.4545
quadrupole: 20.5363 -13.9112 -6.6250 -2.1459 -1.8493 1.4545
hfenergy: -808.7019011 hartree
pointgroup: C01 [X(C18H24N2)]
dipole: -1.5120607 0.6941366 -0.2096178 debye
polarizability: 276.378947|-4.0210493|212.073468|3.9925904|3.9707381|151.4870742 unknown
InChI: InChI=1S/C18H24N2/c1-14(2)13-15(3)20(17-7-5-4-6-8-17)18-11-9-16(19)10-12-18/h4-12,14-15H,13,19H2,1-3H3
charge 0 multiplicity 1
44 atoms
N  0.193609 -0.030917 0.424362
N  -5.396412 -0.616445 -0.582666
C  0.732586 1.346887 0.675965
C  1.114701 2.037907 -0.674407
C  2.136285 3.217939 -0.667257
C  -0.262907 2.163728 1.526031
C  3.506826 2.819024 -0.066155
C  1.618727 4.529376 -0.024779
C  -1.222333 -0.182333 0.160944
C  1.061165 -1.119391 0.177127
C  -2.107361 -0.584547 1.191759
C  -1.759817 0.052822 -1.130464
C  0.529905 -2.408039 -0.150291
C  2.485085 -0.99701 0.259012
C  -3.487565 -0.730297 0.954697
C  -3.138472 -0.084768 -1.382787
C  -4.02872 -0.47689 -0.340148
C  1.378683 -3.51054 -0.364317
C  3.32077 -2.113812 0.04515
C  2.785009 -3.38304 -0.267561
H  1.646492 1.214732 1.285056
H  0.178594 2.385399 -1.158307
H  1.537139 1.24872 -1.328636
H  2.309201 3.442607 -1.742362
H  -1.187288 2.388736 0.96561
H  -0.543124 1.607663 2.43815
H  0.192365 3.118801 1.832497
H  3.912586 1.913596 -0.554974
H  4.243034 3.633886 -0.198761
H  3.432409 2.620188 1.020199
H  0.595068 4.770468 -0.366888
H  1.604252 4.470211 1.078894
H  2.277398 5.375852 -0.296304
H  -1.696721 -0.788405 2.186896
H  -1.08369 0.331844 -1.945961
H  -0.553038 -2.538135 -0.230696
H  2.953115 -0.036177 0.48594
H  -4.152412 -1.042068 1.769784
H  -3.531395 0.103184 -2.389858
H  0.932628 -4.482088 -0.609377
H  4.40717 -1.981788 0.119992
H  3.440606 -4.243868 -0.435124
H  -6.0298 -0.904979 0.156729
H  -5.781454 -0.448834 -1.507216
