program: Gaussian 09
title: 000093328
version: EM64L-G09RevD.01
frameworkgroup: C1[X(C15H13I2NO4)]
method: RPBEPBE
basis: SDD
operation: Freq
keyword: #p
keyword: freq=noraman
keyword: PBEPBE/SDD
title: #p freq=noraman PBEPBE/SDD
converged: YES YES NO NO
title: Mulliken charges:
elementType: I I O O O O N C C C C C C C C C C C C C C C H H H H H H H H H H H H H
charge: 0.131301 0.147010 -0.301434 -0.402234 -0.246814 -0.389790 -0.572768 -0.602979 -0.187518 0.516919 -0.390199 -0.385155 0.326258 -0.364798 -0.382987 0.204204 0.354133 -0.296728 -0.355123 -0.468236 -0.474117 0.551081 0.216322 0.229198 0.262092 0.253304 0.233922 0.266525 0.256801 0.280009 0.290328 0.294231 0.280191 0.378700 0.348355
chargesum: 0.00000
title: Mulliken charges with hydrogens summed into heavy atoms:
elementType: I I O O O O N C C C C C C C C C C C C C C C
charge: 0.131301 0.147010 -0.301434 -0.023534 -0.246814 -0.041436 -0.002431 -0.157459 0.074573 0.516919 -0.136896 -0.151232 0.326258 -0.098274 -0.126186 0.204204 0.354133 -0.002497 -0.074932 -0.468236 -0.474117 0.551081
polarizability: 3.52702206e+02 7.36568320e+00 2.39056599e+02 -1.39052593e+01 1.60026571e+01 1.33993202e+02
1716.lowfreq: -5.9466 -4.6247 -0.0005 0.0003 0.0003 1.4691 4.2377 10.2419 14.2884
frequency: 3.6519 9.8328 14.0227 24.4332 49.1172 51.1428 61.8265 73.4155 91.0562 122.0946 150.7987 153.2974 179.6386 202.3892 211.7807 227.6682 242.0236 261.0082 272.9190 300.8599 333.5371 356.7063 369.7777 393.4654 410.9562 411.9818 444.1296 483.0615 487.4958 512.1103 527.2956 540.9122 556.6942 594.5745 615.0629 627.1357 636.0641 681.0560 705.9253 709.6431 725.2483 741.1540 767.4929 790.0518 821.6614 833.7038 845.3378 864.9177 885.0046 891.0705 942.8263 950.9369 970.5970 987.8021 1007.0524 1021.8011 1060.4460 1090.3291 1107.6001 1123.4084 1136.5052 1153.4353 1181.0628 1183.8432 1201.5607 1216.3008 1228.8797 1259.5510 1284.4036 1290.1147 1304.5589 1321.7978 1358.6052 1378.7877 1390.6655 1403.9348 1415.0326 1443.8704 1463.7746 1492.8446 1548.0737 1586.6546 1592.6204 1612.9313 1617.7082 1666.6064 2990.5477 3048.1303 3067.1772 3126.0163 3129.9501 3158.6498 3169.1257 3177.1015 3186.9360 3457.5552 3479.6879 3492.8341 3618.0025
redmass: 9.6683 8.3414 6.2583 9.6385 7.5762 5.0108 4.2397 10.3441 21.7638 6.9598 10.6443 7.6236 4.9660 7.0890 1.9128 3.7129 8.0740 4.0302 2.4982 3.3255 5.8059 6.4934 3.0944 5.1712 1.1115 2.8712 4.0821 5.1614 3.2244 3.2591 3.3666 2.2844 3.8785 3.1922 3.1432 1.5833 5.2984 7.6096 5.0157 6.3837 4.6262 4.5396 3.1344 4.5380 3.2742 1.2586 2.0947 1.4661 1.4882 6.5871 1.6645 1.4569 1.3703 4.3199 2.8552 3.2579 2.6071 1.4401 1.7316 1.5577 1.3663 2.1896 1.4327 1.3939 1.8623 2.6513 2.0284 1.6216 2.8593 1.3936 1.3188 1.2281 3.7831 5.5288 5.0519 1.9604 2.9460 3.7776 1.1093 2.5983 7.5840 7.7088 7.3775 1.3348 5.7298 3.7964 1.0594 1.0968 1.0936 1.0898 1.0891 1.0953 1.0954 1.0923 1.0934 1.0650 1.0444 1.0637 1.0996
irintensity: 0.9294 0.1355 5.2333 1.2820 0.7007 0.8267 0.3643 0.3361 0.0715 1.2950 0.3338 0.9948 1.2999 0.4571 51.0430 5.4351 6.1793 8.9361 28.4411 6.7197 1.7838 6.9393 0.2122 10.2462 129.5168 2.4278 16.6191 0.7024 10.8586 85.2326 39.7886 165.8745 26.2776 9.1471 39.3355 203.5541 11.9195 46.8743 10.2539 14.3244 54.6810 20.8340 3.4725 29.1797 23.6154 0.8752 41.2098 19.4232 11.6306 97.8095 7.7694 4.4877 0.5369 59.6908 16.2241 0.1625 198.6998 8.3053 28.7307 196.4539 14.2451 17.4048 98.7768 3.8047 287.2305 16.3131 56.9876 6.5632 65.3887 4.5860 0.1685 4.5827 133.3765 10.2242 2.0866 12.7457 11.2236 402.9549 10.4001 160.0665 59.4813 53.0278 45.1695 118.5227 29.8379 113.4290 41.1257 4.4687 19.7788 15.3606 16.5022 6.3395 4.0677 0.6489 2.3691 87.3722 11.1024 14.4104 8.4670
temp: 298.150 k
press: 1.00000 atm
elementType: 53 53 8 8 8 8 7 6 6 6 6 6 6 6 6 6 6 6 6 6 6 6 1 1 1 1 1 1 1 1 1 1 1 1 1
symmnumber: 1
zpe: 654147.0 jmol-1
zpe.correction: 0.249151 hartree
zpe.thermalcorrener: 0.271510 hartree
zpe.thermalcorrenthalpy: 0.272454 hartree
zpe.thermalcorrgfe: 0.189041 hartree
zpe.sumelectzpe: -956.452338 hartree
zpe.sumelectthermal: -956.429980 hartree
zpe.sumelectthermalent: -956.429036 hartree
zpe.sumelectthermalfe: -956.512448 hartree
dipole: 0.8997 -2.5809 -0.3968
dipole: 2.7619
quadrupole: -133.4133 -155.4540 -160.7031
quadrupole: -11.0032 -8.3186 0.8359
quadrupole: 16.4435 -5.5972 -10.8463 -11.0032 -8.3186 0.8359
hfenergy: -956.7014896 hartree
pointgroup: C01 [X(C15H13I2N1O4)]
dipole: -0.3686847 -1.0221365 -0.0030138 debye
polarizability: 349.8696296|-6.0652339|241.4919474|-28.4368002|3.8527665|134.3904298 unknown
InChI: InChI=1S/C15H13I2NO4/c16-11-6-10(7-12(17)14(11)19)22-9-3-1-8(2-4-9)5-13(18)15(20)21/h1-4,6-7,13,19-20H,5,18H2
charge 0 multiplicity 1
35 atoms
I  6.615547 -1.087891 -1.01045
I  2.922804 3.554463 0.642773
O  1.390579 -1.791969 0.478439
O  -3.422012 2.04156 0.957904
O  -4.319671 1.999441 -1.182512
O  5.513894 1.974717 -0.313845
N  -6.315035 0.359017 0.198873
C  -4.25692 -1.020482 -0.44384
C  -4.869802 0.174675 0.383349
C  -2.766967 -1.222028 -0.229456
C  -1.816446 -0.59843 -1.079427
C  -2.285922 -2.008739 0.849647
C  0.015548 -1.519844 0.230512
C  -0.429585 -0.74287 -0.862715
C  -0.904224 -2.160674 1.086667
C  -4.201621 1.479554 -0.049235
C  2.37507 -0.81099 0.22533
C  2.167823 0.567215 0.469444
C  3.634913 -1.288152 -0.193375
C  4.684691 -0.368497 -0.369121
C  3.230977 1.467906 0.277539
C  4.513747 1.025847 -0.146228
H  -4.819135 -1.925674 -0.14445
H  -4.47855 -0.825607 -1.510267
H  -4.659787 0.018092 1.454647
H  -2.164798 0.000316 -1.929575
H  -3.000113 -2.512311 1.512591
H  0.289117 -0.271748 -1.54081
H  -0.526493 -2.767997 1.914424
H  -6.905379 -0.365873 0.611066
H  -6.588754 0.636589 -0.747807
H  1.194558 0.925141 0.813737
H  3.768012 -2.357684 -0.367542
H  -3.001112 2.881616 0.624072
H  6.363948 1.543812 -0.602858
