program: Gaussian 09
title: 000093313
version: EM64L-G09RevD.01
frameworkgroup: C1[X(C14H16N2O8S2)]
method: RPBEPBE
basis: SDD
operation: Freq
keyword: #p
keyword: freq=noraman
keyword: PBEPBE/SDD
title: #p freq=noraman PBEPBE/SDD
converged: YES YES NO NO
title: Mulliken charges:
elementType: S S O O O O O O O O N N C C C C C C C C C C C C C C H H H H H H H H H H H H H H H H
charge: 0.055687 0.021146 -0.200373 -0.207895 -0.180221 -0.207297 -0.211521 -0.182068 -0.191272 -0.165199 -0.123466 -0.124706 -0.500317 -0.504580 -0.515117 -0.505626 0.225796 0.221980 0.230779 0.219700 -0.427735 -0.494070 0.313014 0.307155 -0.719319 -0.634346 0.272725 0.270544 0.269658 0.269671 0.330059 0.261612 0.265446 0.274868 0.273745 0.286221 0.265870 0.263691 0.324088 0.288873 0.284886 0.297915
chargesum: 0.00000
title: Mulliken charges with hydrogens summed into heavy atoms:
elementType: S S O O O O O O O O N N C C C C C C C C C C C C C C
charge: 0.055687 0.021146 -0.200373 -0.207895 -0.180221 -0.207297 -0.211521 -0.182068 -0.191272 -0.165199 -0.123466 -0.124706 0.042952 0.034749 0.076554 0.034688 0.225796 0.221980 0.230779 0.219700 0.132231 0.035491 0.313014 0.307155 -0.106359 -0.051546
polarizability: 2.76654560e+02 -3.38340693e+00 2.50390195e+02 -1.64405747e+01 6.53823400e+00 1.57166219e+02
1716.lowfreq: -5.8468 -0.0026 -0.0025 -0.0018 3.4963 5.2992 14.3648 25.0142 29.7169
frequency: 14.1931 24.9956 29.5424 37.8817 42.3259 46.6135 60.5142 63.1379 65.0943 72.7428 79.6691 86.1823 95.3183 106.3811 112.0501 113.9116 119.0327 126.3040 157.3413 168.6025 194.1064 236.6339 275.5724 295.8866 296.6212 315.9158 318.2731 330.8921 354.8999 396.5640 399.0279 432.9114 522.8126 524.0540 535.5121 538.1270 547.4904 548.3294 555.3705 557.8533 568.8035 606.1734 612.4133 627.5077 636.1681 637.0968 644.4327 682.4234 720.8247 728.3790 742.2445 769.5937 816.7062 818.2458 823.0415 883.4248 926.1810 984.0062 989.1361 993.1632 1000.9816 1006.3709 1007.1814 1018.9804 1021.2836 1021.6661 1031.7098 1034.9488 1056.3397 1082.7684 1147.6394 1151.3216 1154.3112 1166.3745 1168.9148 1172.9935 1194.9019 1210.6481 1211.0676 1233.2254 1237.0398 1242.1327 1283.3687 1288.5613 1294.1189 1294.9147 1298.5847 1310.6231 1320.9885 1343.4046 1429.8003 1436.7918 1437.0220 1440.4818 1442.4672 1446.1945 1453.1181 1457.1945 1656.6302 1658.2820 1703.0304 1706.3579 1736.9454 1738.0872 3000.1545 3015.0136 3027.7640 3029.3869 3030.0972 3034.0264 3038.2481 3051.0213 3071.1965 3084.1211 3086.1841 3091.7969 3099.9232 3101.1353 3129.5252 3134.7984
redmass: 6.9489 7.4132 7.5263 10.1648 9.9454 7.0091 8.5497 5.5341 5.1347 6.9529 4.9724 2.6334 3.5951 2.9894 3.6257 3.9687 6.7714 5.1712 9.2254 3.2368 3.8882 7.7779 6.5625 10.5186 5.7600 5.5195 9.1205 5.8424 6.5222 6.4987 4.7635 17.3248 4.7963 3.5250 3.4057 3.5217 3.7460 3.1739 3.4894 3.6231 10.4121 5.1992 7.1780 8.1554 5.5384 5.9142 4.3713 6.7701 5.9364 5.2799 10.0045 1.3879 1.5007 1.8607 3.4884 1.8546 2.3440 1.7352 4.4405 3.3578 4.0223 2.1835 2.2266 5.5451 4.0421 2.6878 4.4692 4.5925 2.4359 3.0987 1.1950 1.2295 1.1874 7.4949 1.3359 9.4739 1.3349 1.1113 1.1156 2.2179 2.9790 1.3340 1.1697 1.2011 1.9816 1.6196 2.3451 1.5231 1.3863 1.5455 1.0751 1.0891 1.0742 1.0754 1.0875 1.0807 1.0902 1.0878 12.4754 12.3612 12.4235 12.3568 11.7221 11.7995 1.0631 1.0609 1.0614 1.0594 1.0623 1.0640 1.0631 1.0577 1.0948 1.1036 1.1014 1.1010 1.1000 1.1019 1.1028 1.1091
irintensity: 0.1396 0.3736 0.9699 0.1464 0.6665 2.6901 1.6800 1.2247 1.5553 3.4429 2.6986 0.1986 4.1366 0.6715 1.6543 1.3505 17.1717 2.4354 3.2268 2.8385 0.6969 16.1938 2.6979 0.5114 4.2499 1.3933 0.4097 12.2738 4.6203 11.6174 8.7689 1.0913 13.3267 0.3379 0.2480 0.3815 1.1984 3.8073 2.0771 5.4527 15.5226 1.6157 6.6107 2.8010 102.5536 7.2393 40.3281 48.0846 1.5446 6.8709 66.3628 32.2150 17.2914 15.8766 91.0798 69.7083 8.1521 2.4709 163.7757 124.0436 38.5309 1.6884 5.7449 21.0058 13.8557 3.0204 71.7724 8.2385 33.0922 12.5324 0.5215 5.3670 21.3234 300.7282 17.3904 185.7085 46.4513 0.1535 1.9483 38.7927 61.8493 25.5852 13.3334 15.4866 28.2654 18.3326 43.1516 15.7284 8.2632 86.4475 13.4335 28.2503 1.1653 2.7140 10.2313 38.1560 28.1153 35.4424 1139.0996 187.1730 32.2155 84.3858 1.7167 175.7942 13.5207 4.3036 7.2947 11.4870 5.9107 8.2329 1.5561 15.5632 3.6049 0.0524 20.8558 2.1496 18.9490 5.2534 1.1397 8.0754
temp: 298.150 k
press: 1.00000 atm
elementType: 16 16 8 8 8 8 8 8 8 8 7 7 6 6 6 6 6 6 6 6 6 6 6 6 6 6 1 1 1 1 1 1 1 1 1 1 1 1 1 1 1 1
symmnumber: 1
zpe: 782254.9 jmol-1
zpe.correction: 0.297945 hartree
zpe.thermalcorrener: 0.325348 hartree
zpe.thermalcorrenthalpy: 0.326292 hartree
zpe.thermalcorrgfe: 0.234952 hartree
zpe.sumelectzpe: -2048.515950 hartree
zpe.sumelectthermal: -2048.488547 hartree
zpe.sumelectthermalent: -2048.487603 hartree
zpe.sumelectthermalfe: -2048.578944 hartree
dipole: 2.7980 3.0445 -1.7142
dipole: 4.4762
quadrupole: -137.8959 -171.6728 -169.3432
quadrupole: 30.6424 4.5232 -2.1921
quadrupole: 21.7414 -12.0355 -9.7059 30.6424 4.5232 -2.1921
hfenergy: -2048.8138952 hartree
pointgroup: C01 [X(C14H16N2O8S2)]
dipole: 0.8175849 -1.4152317 0.6557759 debye
polarizability: 276.6768821|-2.6854538|250.0504527|18.0758568|4.4087185|157.4836397 unknown
InChI: InChI=1S/C14H16N2O8S2/c17-9-1-2-10(18)15(9)23-13(21)5-7-25-26-8-6-14(22)24-16-11(19)3-4-12(16)20/h1-8H2
charge 0 multiplicity 1
42 atoms
S  -0.73918 4.388401 0.69902
S  -2.124727 3.519714 -0.87232
O  2.370608 0.428016 -0.762043
O  -3.574709 0.004537 0.508827
O  5.163608 1.116772 -0.577402
O  2.093156 -2.450716 -0.338336
O  -0.742454 -0.145981 0.93082
O  -4.584576 -2.663619 -0.098754
O  2.488807 0.937048 1.550558
O  -3.30789 0.12422 -1.842226
N  3.425789 -0.494045 -0.519101
N  -2.807747 -1.191787 0.457779
C  5.607486 -1.32867 -0.207977
C  4.591537 -2.501578 -0.157752
C  -0.961993 -2.632416 0.635821
C  -2.210032 -3.445952 0.195406
C  4.78367 -0.062628 -0.454567
C  3.202404 -1.878257 -0.337782
C  -1.41008 -1.176349 0.703504
C  -3.38152 -2.460083 0.149932
C  1.060173 2.28599 0.013744
C  -4.450768 1.951309 -0.579979
C  2.007274 1.193391 0.445652
C  -3.725976 0.639477 -0.804776
C  0.26556 2.858286 1.194369
C  -3.595459 2.971177 0.21103
H  6.163975 -1.204584 0.736496
H  6.352207 -1.434214 -1.014778
H  4.752211 -3.243862 -0.958282
H  4.609916 -3.045853 0.801331
H  -0.100406 -2.709862 -0.046916
H  -0.594695 -2.929903 1.634378
H  -2.460086 -4.271391 0.882583
H  -2.090019 -3.883094 -0.811127
H  1.670322 3.074356 -0.470739
H  0.375945 1.890192 -0.757191
H  -4.742117 2.351496 -1.565685
H  -5.371609 1.750877 -0.001016
H  -0.411327 2.09911 1.610335
H  0.927826 3.236528 1.994237
H  -4.191359 3.863682 0.455731
H  -3.193844 2.521168 1.130796
