program: Gaussian 09
title: 000093203
version: EM64L-G09RevD.01
frameworkgroup: C1[X(C3H5N3O)]
method: RPBEPBE
basis: SDD
operation: Freq
keyword: #pfreq=noraman
keyword: PBEPBE/SDD
title: #p freq=noraman PBEPBE/SDD
converged: YES YES NO NO
title: Mulliken charges:
elementType: O N N N C C C H H H H H
charge: -0.189806 -0.120774 0.118436 -0.019753 -0.347226 -0.638062 -0.019018 0.257490 0.249889 0.239235 0.235933 0.233656
chargesum: 0.00000
title: Mulliken charges with hydrogens summed into heavy atoms:
elementType: O N N N C C C
charge: -0.189806 -0.120774 0.118436 -0.019753 0.160152 0.070762 -0.019018
polarizability: 8.55223431e+01 2.97744713e+00 5.39530450e+01 7.61509385e-03 3.46797367e+00 3.54618299e+01
1716.lowfreq: -6.5581 0.0004 0.0009 0.0011 3.5332 7.9619 42.0454 134.2449 167.4863
frequency: 42.0262 134.2440 167.4860 210.3099 261.6413 314.0592 409.4410 483.9282 509.6126 582.1761 727.9918 781.6657 866.0866 983.6293 1083.4691 1139.0953 1227.0283 1305.3941 1350.5705 1395.4348 1413.1772 1465.2932 1471.1755 1480.8311 2175.4233 2996.9798 3015.0446 3072.8661 3096.9838 3108.2800
redmass: 2.6942 6.2783 4.0407 1.3216 6.7543 2.6863 5.3723 12.2252 9.1377 4.8404 4.2331 1.5215 3.2051 2.1151 2.1077 1.9684 3.0016 1.3034 1.3962 1.2803 5.2138 1.1147 1.0434 1.0566 12.5961 1.0356 1.0587 1.1038 1.0999 1.1023
irintensity: 0.3357 3.0925 4.4212 1.9531 0.6933 1.8611 4.2622 53.7364 7.3660 1.1525 28.9297 94.4829 124.2447 10.7879 7.9173 12.7842 12.3248 12.4391 10.5755 20.3296 204.1400 15.6695 10.4357 14.3288 63.5572 13.8658 14.8440 2.7073 21.3453 18.2602
temp: 298.150 k
press: 1.00000 atm
elementType: 8 7 7 7 6 6 6 1 1 1 1 1
symmnumber: 1
zpe: 222932.1 jmol-1
zpe.correction: 0.084910 hartree
zpe.thermalcorrener: 0.092622 hartree
zpe.thermalcorrenthalpy: 0.093566 hartree
zpe.thermalcorrgfe: 0.052325 hartree
zpe.sumelectzpe: -356.158299 hartree
zpe.sumelectthermal: -356.150588 hartree
zpe.sumelectthermalent: -356.149644 hartree
zpe.sumelectthermalfe: -356.190884 hartree
dipole: -1.6863 3.5060 0.9666
dipole: 4.0087
quadrupole: -53.6491 -40.3451 -38.9903
quadrupole: 0.0002 0.0386 -0.1633
quadrupole: -9.3209 3.9830 5.3379 0.0002 0.0386 -0.1633
hfenergy: -356.2432095 hartree
pointgroup: C01 [X(C3H5N3O1)]
dipole: -0.9998944 1.1477572 0.4126472 debye
dipolederiv: -1.1491059 -0.845573 0.0073782 -0.0521081 -0.2869699 -0.0273487 0.1862393 0.1298866 -0.1423812 -0.7817628 -0.1876707 0.0671113 -0.6497656 -0.6722746 0.0469149 -0.0777642 -0.0728693 -0.11853 1.1849449 1.1468854 0.025525 0.859381 0.9142085 0.0746271 0.0191273 0.016747 0.012491 -0.3573188 -0.0220419 0.0010312 0.007317 -0.1977466 0.0064305 0.0229504 0.0162226 -0.2347827 0.1517987 -0.3053022 0.0016795 -0.2300966 0.2489671 0.0172874 0.0272634 0.0669418 0.2795737 0.0662638 0.0669212 0.0121704 0.0419719 -0.0211357 0.0247173 -0.0120624 -0.0209754 -0.0275835 0.7857346 0.0917851 -0.084059 0.0626259 -0.1265442 -0.0723536 -0.1128174 -0.0957673 0.1046451 0.0085419 0.0235604 0.0607264 -0.0650491 0.0615902 0.0559202 0.0095623 0.0156559 0.0980461 0.0676179 0.0406805 -0.1184367 0.0244822 0.0103816 -0.0421775 -0.06316 -0.0423016 -0.0464821 -0.0762213 -0.0867381 0.0587086 -0.0402067 0.0823387 0.0377178 0.0196468 0.0417747 0.0687354 0.0604744 -0.0380008 -0.0822547 -0.0617836 0.0478249 -0.0715827 -0.0762704 -0.014757 -0.0557748 0.0390325 0.1154941 0.0504198 0.1032317 -0.06064 -0.0501527 0.0572849 -0.040558 0.0620431 unknown
polarizability: 80.6989933|11.2541143|58.4518245|-5.3902743|1.284088|35.7864002 unknown
InChI: InChI=1S/C3H5N3O/c1-2-6(3-4)5-7/h2H2,1H3
charge 0 multiplicity 1
12 atoms
O  -1.760201 -1.52456 0.137505
N  0.042999 -0.122559 0.18059
N  -0.526066 -1.462474 -0.095761
N  2.539247 0.122246 -0.289436
C  -0.787187 1.020592 0.653723
C  -0.969054 2.101961 -0.428549
C  1.365666 0.008524 -0.069687
H  -1.758481 0.575498 0.937441
H  -0.311971 1.435128 1.560297
H  0.000647 2.526391 -0.742304
H  -1.478847 1.692962 -1.317166
H  -1.586552 2.92249 -0.022552
