program: Gaussian 09
title: 000093183
version: EM64L-G09RevD.01
frameworkgroup: C1[X(C10H6N2)]
method: RPBEPBE
basis: SDD
operation: Freq
keyword: #pfreq=noraman
keyword: PBEPBE/SDD
title: #p freq=noraman PBEPBE/SDD
converged: NO NO NO NO
title: Mulliken charges:
elementType: N N C C C C C C C C C C H H H H H H
charge: 0.009764 -0.019108 0.424722 -0.198644 0.359338 -0.393661 -0.310758 -0.377878 -0.230245 -0.168213 -0.361069 -0.215679 0.241918 0.248200 0.263526 0.240701 0.236015 0.251071
chargesum: 0.00000
title: Mulliken charges with hydrogens summed into heavy atoms:
elementType: N N C C C C C C C C C C
charge: 0.009764 -0.019108 0.424722 -0.198644 0.359338 -0.151744 -0.062557 -0.114352 0.010456 0.067802 -0.109998 -0.215679
polarizability: 1.63598978e+02 1.84145485e+00 1.46548443e+02 -3.62298035e-03 1.46567967e-03 4.52663180e+01
1716.lowfreq: -15.7547 -5.8056 -0.0006 -0.0004 0.0003 7.8549 102.4779 132.1437 174.0779
frequency: 102.4701 132.1241 174.0766 199.4543 345.6214 374.6863 432.2124 453.2150 469.3565 484.2147 539.6856 588.0420 590.6598 653.9362 670.9277 774.6078 803.7415 809.6835 849.6241 856.2079 930.5496 949.5464 988.9059 998.5427 1023.8328 1030.7011 1071.6537 1141.9454 1178.3964 1223.5793 1242.9658 1255.8715 1340.1820 1375.6022 1399.8501 1419.2746 1455.8492 1494.4171 1560.0792 1589.8602 1612.8321 2179.6277 3128.8743 3131.0662 3137.6256 3151.6775 3167.6308 3170.7747
redmass: 6.2696 9.5691 4.2324 4.5023 6.0001 4.9232 9.2314 4.4853 3.1058 7.0770 6.9878 7.2906 4.1418 3.2049 7.3137 1.3194 5.5864 1.7505 6.2726 2.6510 1.3834 1.4507 1.3644 1.3938 5.0047 2.6694 2.1912 1.3407 1.2365 2.0311 1.6936 2.3104 5.2732 2.0336 2.5000 2.9221 2.6846 4.0319 6.3813 5.7793 6.8057 12.6316 1.0886 1.0876 1.0922 1.0918 1.0997 1.0988
irintensity: 0.0032 1.5949 5.8675 0.0045 3.6216 3.2414 0.2975 4.1080 1.6375 0.7950 1.1410 0.8680 0.5632 0.5470 4.7996 10.8779 0.8806 71.9669 2.9788 50.5529 0.2267 0.1890 0.0622 2.3321 4.8083 0.4414 7.3489 3.3876 0.8744 1.7264 3.0416 3.2575 3.9120 17.8415 1.7504 1.8393 4.8545 21.5957 11.6868 10.8114 3.0108 13.1777 2.6888 4.2231 15.7530 11.1500 27.9467 10.3298
temp: 298.150 k
press: 1.00000 atm
elementType: 7 7 6 6 6 6 6 6 6 6 6 6 1 1 1 1 1 1
symmnumber: 1
zpe: 344861.0 jmol-1
zpe.correction: 0.131351 hartree
zpe.thermalcorrener: 0.140029 hartree
zpe.thermalcorrenthalpy: 0.140973 hartree
zpe.thermalcorrgfe: 0.097387 hartree
zpe.sumelectzpe: -493.356019 hartree
zpe.sumelectthermal: -493.347341 hartree
zpe.sumelectthermalent: -493.346397 hartree
zpe.sumelectthermalfe: -493.389983 hartree
dipole: -4.7045 4.9863 0.0002
dipole: 6.8554
quadrupole: -65.7553 -66.9996 -71.7665
quadrupole: 12.8978 0.0005 -0.0006
quadrupole: 2.4185 1.1742 -3.5927 12.8978 0.0005 -0.0006
hfenergy: -493.4873699 hartree
pointgroup: C01 [X(C10H6N2)]
dipole: -1.9400722 1.8736418 0.0000971 debye
dipolederiv: -0.4396036 -0.0632297 0.0000051 -0.0754812 -0.2636662 0.0000042 -0.0000033 -0.0000014 -0.2128093 -0.3578713 0.058276 -0.0000073 0.0871072 -0.2312643 0.0000109 0.0000053 0.0000021 -0.2471453 -0.1571303 0.0143566 0.0000051 0.1370159 -0.1421276 -0.0000057 0.0000036 -0.0000072 0.0984921 0.2174464 0.1954135 -0.000003 0.0957937 0.04187 -0.0000019 0.000003 -0.0000041 0.0144857 0.1766838 -0.0491059 -0.0000054 0.0217155 0.0286905 -0.000001 -0.0000233 0.0000215 0.120252 0.0777031 -0.0629294 -0.0000064 0.032304 0.088864 -0.0000014 -0.000015 0.0000052 -0.1562994 0.194259 0.0219225 -0.0000028 -0.0785277 0.1742474 0.0000018 0. 0.0000033 -0.1379696 0.1054101 0.0298833 -0.0000046 -0.115847 -0.0479125 -0.0000016 0.0000037 -0.0000057 -0.1389676 -0.2202013 0.025261 0.0000011 0.0403717 0.1707376 -0.0000039 0.0000069 -0.0000054 -0.1470841 0.085836 0.106789 -0.0000002 -0.0329962 -0.3381047 0.000001 0. -0.0000043 -0.102905 0.1599324 -0.1257547 -0.0000033 0.0723158 0.450226 0.0000043 -0.0000035 0.0000074 -0.050459 0.183629 -0.1220751 0.0000008 -0.1480276 0.0893218 -0.0000034 0.0000087 -0.0000082 0.0339013 -0.0053767 0.1188246 0.0000046 0.050998 -0.0146123 -0.0000023 0.0000079 -0.0000047 0.1594041 0.0110678 0.0544647 0.0000025 0.11822 -0.0102005 -0.0000021 -0.0000003 -0.0000005 0.1446408 -0.0509336 -0.0300597 0.0000059 -0.0236281 0.094899 0.000001 0.0000014 0.0000004 0.1650051 0.0687741 -0.0579653 0.0000032 -0.0447681 -0.0886745 0.0000009 0.0000021 0.0000031 0.1640376 -0.098086 -0.058113 0.000003 -0.0540108 0.084729 -0.0000003 0.0000018 -0.0000005 0.1646417 0.048461 -0.0559584 0.0000016 -0.0825551 -0.0870228 -0.0000008 0.0000009 -0.0000009 0.128779 unknown
polarizability: 163.3912057|2.624961|146.7562161|-0.0036872|0.0012957|45.266318 unknown
InChI: InChI=1S/C10H6N2/c11-7-9-4-1-3-8-5-2-6-12-10(8)9/h1-6H
charge 0 multiplicity 1
18 atoms
N  -0.451461 -1.596048 0.000037
N  3.15725 -1.816202 -0.000174
C  -1.056501 0.817673 0.000067
C  -0.087324 -0.260663 0.000063
C  1.317662 0.069781 0.000022
C  -0.604554 2.17601 0.00005
C  -2.442835 0.455756 0.000085
C  1.724283 1.41658 -0.000008
C  0.761332 2.467345 0.00002
C  -2.801574 -0.892625 0.000078
C  -1.768151 -1.883545 0.000054
C  2.303918 -0.977839 -0.000062
H  -1.34512 2.984684 0.000073
H  -3.205949 1.242379 0.000095
H  2.793229 1.652074 -0.000039
H  1.103805 3.507153 0.000008
H  -3.851628 -1.201631 0.000085
H  -2.025381 -2.94908 0.000047
