program: Gaussian 09
title: 000093177
version: EM64L-G09RevD.01
frameworkgroup: C1[X(C10H6N2)]
method: RPBEPBE
basis: SDD
operation: Freq
keyword: #pfreq=noraman
keyword: PBEPBE/SDD
title: #p freq=noraman PBEPBE/SDD
converged: YES YES NO YES
title: Mulliken charges:
elementType: N N C C C C C C C C C C H H H H H H
charge: -0.014130 -0.010938 0.424287 -0.030078 -0.416748 -0.382752 -0.296139 0.387147 -0.238548 -0.211793 -0.483485 -0.256321 0.271685 0.241765 0.267744 0.237366 0.238849 0.272087
chargesum: 0.00000
title: Mulliken charges with hydrogens summed into heavy atoms:
elementType: N N C C C C C C C C C C
charge: -0.014130 -0.010938 0.424287 -0.030078 -0.145063 -0.140987 -0.028394 0.387147 -0.001181 0.027056 -0.211398 -0.256321
polarizability: 2.12848996e+02 -1.86062179e+00 1.11722724e+02 3.82392823e-03 2.45170694e-03 4.51298040e+01
1716.lowfreq: -0.0012 -0.0007 -0.0005 4.0898 8.9894 13.5903 85.7891 131.2234 178.8314
frequency: 85.7737 131.2232 178.8308 221.3898 357.3086 386.4291 392.4372 443.7898 477.1347 512.1775 554.3067 562.3549 607.7454 658.9035 664.9963 750.4241 768.4858 799.9607 878.7909 881.5867 931.1608 942.0647 964.0331 976.6543 1002.9322 1017.6333 1118.1288 1152.5911 1177.4420 1205.5006 1250.3540 1274.1632 1356.5160 1364.0068 1386.6683 1424.0784 1454.2794 1482.6347 1554.2555 1588.2725 1624.3990 2176.2119 3128.9102 3137.6053 3143.4649 3149.6173 3161.6274 3176.2030
redmass: 6.4625 8.6759 3.7322 6.7048 5.1450 4.1082 9.2239 4.0141 2.9215 7.1807 7.8344 5.3483 7.1200 2.8998 9.4874 5.1378 1.3568 2.7390 5.4851 1.5076 1.5871 1.4626 5.2370 1.3986 1.3403 2.1680 1.7813 1.7958 1.2708 2.2512 2.0320 1.6382 2.2378 3.2452 2.4207 5.4552 2.6210 3.3058 7.2077 5.7200 6.5582 12.6302 1.0876 1.0925 1.0897 1.0937 1.0953 1.0994
irintensity: 0.7060 2.9618 0.0649 7.7767 4.0671 1.2085 0.1761 2.3196 10.2776 0.6744 3.8980 0.0247 4.1110 0.2138 1.0908 1.5645 64.4004 16.1809 0.1447 5.5340 35.0476 2.0433 6.9680 10.6358 0.1022 4.2002 9.8320 0.0378 3.3391 1.3523 3.4720 1.3376 8.6075 5.4678 14.6687 0.8554 3.7509 21.3887 14.2381 7.0455 15.3227 42.1839 1.9681 6.9484 8.2973 2.8074 18.0951 16.9870
temp: 298.150 k
press: 1.00000 atm
elementType: 7 7 6 6 6 6 6 6 6 6 6 6 1 1 1 1 1 1
symmnumber: 1
zpe: 344736.6 jmol-1
zpe.correction: 0.131303 hartree
zpe.thermalcorrener: 0.139981 hartree
zpe.thermalcorrenthalpy: 0.140925 hartree
zpe.thermalcorrgfe: 0.097271 hartree
zpe.sumelectzpe: -493.357488 hartree
zpe.sumelectthermal: -493.348810 hartree
zpe.sumelectthermalent: -493.347866 hartree
zpe.sumelectthermalfe: -493.391520 hartree
dipole: 4.8412 -1.5451 0.0002
dipole: 5.0818
quadrupole: -78.7218 -64.7751 -71.7662
quadrupole: -5.1813 -0.0011 0.0000
quadrupole: -6.9674 6.9793 -0.0119 -5.1813 -0.0011 0.0000
hfenergy: -493.4887908 hartree
pointgroup: C01 [X(C10H6N2)]
dipole: -1.895608 -0.6356157 -0.0000664 debye
dipolederiv: -0.4597554 -0.0038194 -0.0000037 0.0669917 -0.2831311 0.0000043 -0.0000071 0.0000014 -0.2371557 -0.5106768 0.0388641 0.0000415 0.0423535 -0.216232 -0.0000106 -0.0000014 0.000002 -0.2408187 -0.208241 0.0594179 -0.0000054 0.2901889 -0.1604803 0.0000105 -0.0000158 0.0000086 0.0762061 0.4091888 0.1494086 -0.0000011 -0.2000085 -0.0039297 -0.0000014 0.0000094 0.0000038 0.0572188 0.3422067 0.0086198 0.0000066 0.0661467 0.1440079 -0.0000055 0.000021 -0.0000109 -0.1199262 -0.0331109 -0.0725664 0.0000031 0.0414101 0.1180457 -0.0000063 -0.0000023 -0.0000082 -0.1626411 -0.2030631 -0.0961349 0.0000017 -0.1179647 0.1115389 -0.0000096 0.0000031 -0.0000098 -0.1386675 -0.2401451 -0.0016254 -0.0000133 -0.1623922 -0.0789635 0.0000071 0.0000051 0.0000064 0.1462287 -0.0224318 0.1475367 -0.0000047 0.1562089 0.056514 -0.0000046 -0.0000053 -0.0000058 -0.1415215 0.1248976 -0.0915425 0.0000061 -0.0872825 0.0061722 -0.0000055 0.0000095 -0.0000053 -0.140381 0.1792221 0.004969 0.0000003 -0.026524 0.3915639 -0.0000197 0.000014 -0.0000149 -0.0540647 0.5284613 -0.1029966 -0.0000252 -0.0598858 -0.051473 0.0000106 -0.0000202 0.0000007 0.0276637 0.0816781 0.00837 -0.0000005 0.0500398 -0.0293887 0.0000071 -0.0000026 0.000005 0.1517068 0.0649322 0.0720373 -0.0000028 0.0005756 -0.0821843 0.0000071 -0.0000012 0.0000088 0.160383 0.0872675 0.0050781 -0.0000009 0.0615595 -0.0312579 0.0000067 -0.0000031 0.0000065 0.1616643 -0.0285539 -0.0999747 0.0000013 -0.1074121 0.0001687 0.0000042 0.0000018 0.0000039 0.1620792 -0.1020786 0.0559038 -0.0000052 0.0532787 0.0772065 0.0000032 -0.0000054 0.0000036 0.1594365 -0.0097976 -0.0815453 0.0000022 -0.0672836 0.0318229 0.0000024 0.0000003 0.0000043 0.1325894 unknown
polarizability: 212.773141|3.3357326|111.7985793|0.0038593|-0.0023956|45.129804 unknown
InChI: InChI=1S/C10H6N2/c11-6-8-5-9-3-1-2-4-10(9)12-7-8/h1-5,7H
charge 0 multiplicity 1
18 atoms
N  0.082734 1.765326 -0.000062
N  4.368234 -0.546068 0.0002
C  -0.566679 -0.639597 0.000007
C  -0.895759 0.773857 -0.000039
C  0.814185 -1.003509 0.000036
C  -1.625719 -1.604849 0.000027
C  -2.267842 1.17333 -0.000063
C  1.793521 0.002965 0.000015
C  -2.957796 -1.18677 0.000003
C  -3.279842 0.209124 -0.000045
C  1.367223 1.385027 -0.000037
C  3.195376 -0.30895 0.000035
H  1.105475 -2.059337 0.000072
H  -1.376007 -2.672484 0.000062
H  -2.485675 2.245437 -0.000098
H  -3.765731 -1.925937 0.000021
H  -4.330489 0.518615 -0.000069
H  2.121688 2.179822 -0.000064
