program: Gaussian 09
title: 000009589
version: EM64L-G09RevD.01
frameworkgroup: C1[X(C7H7NO)]
method: RPBEPBE
basis: SDD
operation: Freq
keyword: #pfreq=noraman
keyword: PBEPBE/SDD
title: #p freq=noraman PBEPBE/SDD
converged: NO YES NO NO
title: Mulliken charges:
elementType: O N C C C C C C C H H H H H H H
charge: -0.222661 0.003263 0.281263 0.141887 -0.254728 -0.438495 -0.178900 -0.777379 -0.329442 0.286664 0.257284 0.240385 0.262470 0.240691 0.238377 0.249324
chargesum: 0.00000
title: Mulliken charges with hydrogens summed into heavy atoms:
elementType: O N C C C C C C C
charge: -0.222661 0.003263 0.281263 0.141887 0.031936 -0.181211 0.059476 -0.033834 -0.080118
polarizability: 1.13389937e+02 -1.60878635e-01 8.74271018e+01 2.84277719e-02 1.96797244e-02 3.87629306e+01
1716.lowfreq: -5.0476 -0.0005 0.0006 0.0008 13.8607 15.0444 63.9417 148.1516 149.4782
frequency: 63.8590 148.1403 149.4655 207.5559 356.1161 365.9383 412.0702 451.8300 575.3360 601.5411 615.2931 716.2640 742.1659 823.9739 923.9224 949.4998 963.0382 997.6039 1007.5192 1021.3524 1031.7702 1080.7932 1110.8621 1198.2722 1275.8440 1312.3753 1332.3823 1375.5782 1406.6630 1447.2979 1460.7407 1460.8489 1545.5539 1577.6890 1604.7034 2986.4178 3070.0489 3128.0408 3134.5548 3137.5903 3152.2019 3172.0074
redmass: 4.4093 2.9537 1.1513 4.1614 4.5000 2.7507 4.0184 4.8262 4.6638 2.7345 6.7896 1.9237 6.1539 1.5651 1.3990 2.2182 1.4376 3.5647 1.4045 4.2286 1.7871 2.0285 1.5724 1.3680 3.2792 10.2023 1.3037 1.2491 2.0362 1.1344 1.0531 1.9534 5.4431 5.9247 7.8794 1.0378 1.0967 1.0987 1.0887 1.0917 1.0915 1.1003
irintensity: 9.8711 0.5296 0.2855 9.8294 1.3111 0.6869 1.2239 0.9685 13.8898 2.2492 5.9842 38.5257 1.5062 38.4397 2.0762 21.2868 1.2970 7.5247 1.6204 0.9358 0.6433 1.4937 18.3963 3.5096 191.3208 3.4088 2.5190 62.1620 38.5982 23.6784 22.0600 2.5602 6.1773 84.0537 86.5782 2.2821 10.1940 21.0184 14.7416 4.0928 4.0941 20.4418
temp: 298.150 k
press: 1.00000 atm
elementType: 8 7 6 6 6 6 6 6 6 1 1 1 1 1 1 1
symmnumber: 1
zpe: 323558.3 jmol-1
zpe.correction: 0.123237 hartree
zpe.thermalcorrener: 0.131154 hartree
zpe.thermalcorrenthalpy: 0.132098 hartree
zpe.thermalcorrgfe: 0.090308 hartree
zpe.sumelectzpe: -400.263280 hartree
zpe.sumelectthermal: -400.255362 hartree
zpe.sumelectthermalent: -400.254418 hartree
zpe.sumelectthermalfe: -400.296208 hartree
dipole: 0.7793 -0.4020 -0.0035
dipole: 0.8769
quadrupole: -51.8302 -54.4417 -53.7925
quadrupole: 13.5708 0.0153 -0.0055
quadrupole: 1.5246 -1.0869 -0.4377 13.5708 0.0153 -0.0055
hfenergy: -400.3865166 hartree
pointgroup: C01 [X(C7H7N1O1)]
dipole: -0.31412 0.1426318 -0.0013399 debye
dipolederiv: -0.8586939 0.11553 0.0007491 0.2721071 -0.7281835 -0.0015504 -0.0016153 0.0015802 -0.3141241 -0.5090952 -0.0838156 0.0002273 -0.1109183 -0.3459516 0.0001686 -0.0000912 -0.0000699 -0.2489363 -0.7094859 -0.0052228 -0.0001405 -0.1606315 -0.258204 0.0000186 0.0018847 0.00014 0.024443 1.5994167 0.0779689 0.0000984 0.0668905 0.9233204 0.0017186 0.0004223 0.0000829 0.1294491 0.1352295 -0.104808 -0.0004711 0.1163895 0.1028355 -0.0000167 0.0003257 0.0000518 -0.072745 0.2690072 0.0433232 -0.0004674 0.0340466 0.2446802 -0.0000567 0.000714 -0.0001996 -0.0561977 -0.236244 0.1695637 0.0000776 0.2710129 -0.0202663 -0.0004639 -0.0005014 -0.0001856 -0.1084047 -0.2032625 -0.1885225 -0.0005903 -0.305306 -0.385507 -0.0012552 -0.0024385 -0.0030452 0.0459394 0.3858693 0.0472296 -0.0006676 -0.0923322 0.1982011 0.0000784 -0.0005559 -0.0000064 -0.0587261 0.1171664 0.0785716 0.0001049 0.0271151 0.0314396 -0.0000716 0.0002476 -0.0000675 0.1457325 0.0354251 -0.0891848 0.0001594 -0.1178509 -0.0218515 0.0001439 -0.0000427 0.0002974 0.1222945 0.0839119 0.0266224 -0.0823194 0.020703 0.0561512 0.0693963 -0.0510267 0.0842273 -0.0161171 -0.1001761 -0.0054154 -0.0004342 0.063443 0.0933701 0.0001702 -0.0006526 0.0000217 0.1243725 0.0823608 0.0265146 0.0831791 0.0212475 0.0570319 -0.0684792 0.0524928 -0.0830151 -0.0151585 0.0221133 -0.0851744 0.0001578 -0.1058221 -0.0393665 0.0002033 0.0000909 0.0002444 0.1606851 -0.1135426 -0.0231806 0.000337 -0.0000942 0.0923004 -0.0000042 0.0007463 -0.0000564 0.1374934 unknown
polarizability: 113.3411782|1.1353153|87.4758353|-0.0453242|-0.0289651|38.7629558 unknown
InChI: InChI=1S/C7H7NO/c1-6(9)7-3-2-4-8-5-7/h2-5H,1H3
charge 0 multiplicity 1
16 atoms
O  2.368561 -1.212407 0.000988
N  -1.81543 1.260231 0.000072
C  0.275055 -0.031592 -0.002555
C  1.78019 -0.092059 -0.005003
C  -0.465847 -1.244598 -0.001057
C  -0.452004 1.188936 -0.001774
C  -1.872282 -1.190353 0.000839
C  2.570227 1.209489 0.0005
C  -2.502384 0.07849 0.001376
H  0.084255 -2.191444 -0.001608
H  0.06524 2.155101 -0.002844
H  2.33325 1.821457 -0.889929
H  3.645703 0.97779 0.003949
H  2.326929 1.818316 0.891419
H  -2.476025 -2.103064 0.001952
H  -3.594937 0.164507 0.002973
