program: Gaussian 09
title: 000093235
version: EM64L-G09RevD.01
frameworkgroup: C1[X(C19H17N4S)]
method: RPBEPBE
basis: SDD
operation: Freq
keyword: #p
keyword: freq=noraman
keyword: PBEPBE/SDD
title: #p freq=noraman PBEPBE/SDD
converged: YES YES NO NO
title: Mulliken charges:
elementType: S N N N N C C C C C C C C C C C C C C C C C C C H H H H H H H H H H H H H H H H H
charge: 0.408984 -0.209870 -0.057583 -0.014860 -0.092172 0.193591 0.234003 0.204235 -0.125716 0.315201 -0.343554 -0.648063 -0.328285 -0.204974 -0.235689 -0.355030 -0.367784 -0.233539 -0.235292 -0.216775 -0.171506 0.020600 -0.558440 -0.483232 0.260282 0.280617 0.264358 0.261423 0.287773 0.250958 0.250435 0.255753 0.262893 0.252247 0.250217 0.255640 0.284253 0.276417 0.275148 0.231908 0.305428
chargesum: 1.00000
title: Mulliken charges with hydrogens summed into heavy atoms:
elementType: S N N N N C C C C C C C C C C C C C C C C C C C
charge: 0.408984 -0.209870 -0.057583 -0.014860 -0.092172 0.193591 0.234003 0.204235 -0.125716 0.315201 -0.083273 0.158336 -0.040513 0.045984 0.014746 -0.099277 -0.104892 0.018708 0.014925 0.038866 -0.171506 0.304853 0.225034 -0.177804
polarizability: 4.70083780e+02 2.31900467e+01 3.67893907e+02 1.51612197e+01 -4.48111223e+00 1.23087241e+02
1716.lowfreq: -3.6790 -0.8546 -0.0013 -0.0012 -0.0001 5.1128 19.2240 38.2402 42.3783
frequency: 19.1447 38.2338 42.3672 55.0893 67.2637 85.1846 111.7775 124.8154 141.8561 156.0585 173.0184 184.7041 192.1771 212.8351 267.4844 279.6623 286.3954 303.3733 313.8439 350.8960 358.8290 403.1773 411.2053 419.2120 459.4976 497.2690 506.3023 511.7894 538.6953 555.7642 590.5560 604.9806 612.3008 617.7643 641.2382 671.6047 696.4963 702.1077 711.0916 716.1109 759.3148 761.4782 768.7766 781.8914 806.3069 818.9675 857.0547 859.6441 881.3201 884.1531 939.4218 954.5848 965.4738 985.0704 988.4063 1003.5238 1010.8393 1014.7869 1019.6649 1030.1498 1052.8189 1071.5308 1089.2240 1100.3883 1114.7702 1119.2799 1119.5068 1125.2711 1177.6327 1181.8281 1182.9824 1196.8188 1212.7089 1219.5674 1258.2618 1283.4155 1295.4134 1319.3306 1326.8684 1361.0738 1377.6584 1405.1674 1415.4132 1430.6274 1437.0990 1438.8816 1450.0397 1456.0922 1462.9667 1469.7874 1474.2555 1476.1425 1489.7784 1498.6682 1525.5635 1555.5517 1576.6345 1596.7164 1605.4701 1618.9532 3006.3574 3027.2941 3095.9287 3132.6004 3135.6158 3139.4391 3141.3790 3144.0240 3150.2729 3156.5575 3161.3374 3166.8061 3176.7582 3178.1312 3201.5433 3218.9337 3267.7587
redmass: 4.7808 4.8815 4.7231 5.2383 3.7658 5.3050 4.1350 1.3107 3.2495 2.3893 1.5036 3.9034 3.6745 5.9418 4.6458 4.6905 5.3599 3.3859 6.3725 3.8837 3.9059 2.8778 3.7479 6.4225 4.3605 4.0977 6.7112 4.7834 5.7158 7.0315 4.2661 5.9422 6.2104 5.4205 5.7356 6.3207 3.3006 3.5312 2.7308 1.3372 4.9760 3.3837 1.6368 2.1599 4.7033 4.7389 1.2475 1.3061 5.6361 1.4145 1.3980 4.4113 1.3865 2.0233 2.5563 1.3453 1.3418 3.1469 2.4687 2.7618 2.2074 2.4583 1.6738 1.8685 1.3239 1.5940 1.3809 1.5447 1.5448 1.1711 1.5581 1.1407 2.7817 2.1546 2.9901 3.1267 1.9893 1.4755 2.5924 3.2863 6.9568 3.4729 4.1119 1.9108 2.4151 2.2630 1.1490 1.1154 1.9973 1.5512 1.0673 1.1706 1.9448 5.4871 3.7975 5.0697 5.6587 7.2136 6.0130 7.5681 1.0353 1.0329 1.1017 1.1036 1.0946 1.0933 1.1029 1.0881 1.0873 1.0927 1.0921 1.0962 1.0983 1.1016 1.0960 1.0949 1.1030
irintensity: 1.8015 0.7724 1.2694 2.2454 0.9197 1.1769 0.3606 0.7085 2.0558 2.4618 1.6261 0.3079 1.9615 0.7730 1.9111 0.7446 0.2033 1.2284 0.8887 3.4663 2.5425 2.4259 1.4038 4.8818 1.9690 17.9353 3.1049 1.8261 12.6893 8.4506 0.0598 2.9037 5.9753 17.0977 5.1773 11.0941 13.7453 31.6996 13.1894 67.0755 11.5512 5.5669 98.7451 17.5325 14.9327 37.2683 4.9629 0.8285 4.8689 0.1823 2.1017 19.5360 2.4499 5.0386 2.5936 0.1292 0.0279 0.4062 10.8009 5.2371 5.5621 9.3058 19.5213 81.5738 4.6940 147.7977 0.8840 2.5991 8.8049 0.9438 1.6763 23.3550 206.0575 81.6733 165.1450 145.7042 1.8878 71.0084 41.5863 838.4762 189.2588 234.4841 5.2008 41.6513 6.0045 45.0283 7.5141 21.4701 27.9853 27.3575 13.9466 160.5378 26.7098 83.8889 21.8110 60.2527 2.2738 0.0457 27.2510 6.3727 17.8344 9.3271 6.5399 6.9559 3.4797 0.2978 10.1658 0.3291 0.2053 6.6473 4.5518 11.4850 11.4327 9.8843 3.7471 4.8706 22.6413
temp: 298.150 k
press: 1.00000 atm
elementType: 16 7 7 7 7 6 6 6 6 6 6 6 6 6 6 6 6 6 6 6 6 6 6 6 1 1 1 1 1 1 1 1 1 1 1 1 1 1 1 1 1
symmnumber: 1
zpe: 836153.2 jmol-1
zpe.correction: 0.318474 hartree
zpe.thermalcorrener: 0.339307 hartree
zpe.thermalcorrenthalpy: 0.340251 hartree
zpe.thermalcorrgfe: 0.267467 hartree
zpe.sumelectzpe: -1349.370171 hartree
zpe.sumelectthermal: -1349.349338 hartree
zpe.sumelectthermalent: -1349.348394 hartree
zpe.sumelectthermalfe: -1349.421178 hartree
dipole: 1.2616 2.9667 -1.1109
dipole: 3.4098
quadrupole: -54.3646 -96.8675 -144.5282
quadrupole: 11.3241 1.0201 -1.9341
quadrupole: 44.2221 1.7193 -45.9414 11.3241 1.0201 -1.9341
hfenergy: -1349.688645 hartree
pointgroup: C01 [X(C19H17N4S1)]
dipole: -0.462611 -1.1959094 -0.3943417 debye
polarizability: 462.2165107|28.9068437|370.9152202|-43.5332061|-0.0180956|127.9331972 unknown
InChI: InChI=1S/C19H17N4S/c1-22-12-13-24-19(22)21-20-17-15-10-6-7-11-16(15)23(2)18(17)14-8-4-3-5-9-14/h3-13H,1-2H3
charge 1 multiplicity 1
41 atoms
S  -4.619734 1.06463 0.774136
N  2.560205 0.800226 -0.139262
N  -0.87119 -0.076712 0.228875
N  -1.975657 0.710641 0.359747
N  -3.55452 -1.220072 0.017819
C  1.554533 -0.12231 0.016373
C  2.017978 2.125813 -0.135013
C  0.605356 2.036078 0.045807
C  0.29519 0.605743 0.135339
C  1.753348 -1.577408 0.04482
C  2.694405 3.348484 -0.270084
C  4.010762 0.545975 -0.186369
C  -0.166205 3.218542 0.091852
C  1.907174 4.524594 -0.218454
C  0.501359 4.459511 -0.03986
C  2.56721 -2.231513 -0.925866
C  1.108542 -2.358044 1.046942
C  2.73399 -3.630768 -0.88988
C  1.292238 -3.754883 1.086509
C  2.103449 -4.395953 0.119528
C  -3.171319 0.072391 0.343457
C  -4.94137 -1.450214 0.105339
C  -2.622918 -2.297754 -0.409286
C  -5.674825 -0.359707 0.492713
H  3.776786 3.408238 -0.41725
H  4.220153 -0.484748 0.131756
H  4.521289 1.242018 0.499654
H  4.401616 0.697929 -1.207595
H  -1.247194 3.164995 0.229885
H  2.394205 5.499418 -0.320992
H  -0.076369 5.388429 -0.004395
H  3.030634 -1.65408 -1.733601
H  0.494453 -1.860379 1.803272
H  3.350315 -4.123727 -1.648313
H  0.81578 -4.34343 1.877382
H  2.244592 -5.481192 0.153323
H  -5.3325 -2.438365 -0.133433
H  -2.037901 -2.664826 0.447002
H  -1.919025 -1.911488 -1.160141
H  -3.219184 -3.117153 -0.839735
H  -6.750251 -0.287531 0.6275
