program: Gaussian 09
title: 000093144
version: EM64L-G09RevD.01
frameworkgroup: C1[X(C10H14O)]
method: RPBEPBE
basis: SDD
operation: Freq
keyword: #pfreq=noraman
keyword: PBEPBE/SDD
title: #p freq=noraman PBEPBE/SDD
converged: YES YES NO NO
title: Mulliken charges:
elementType: O C C C C C C C C C C H H H H H H H H H H H H H H
charge: -0.446782 -0.027744 -0.552841 0.362080 -0.693549 -0.712022 0.131436 -0.357963 -0.398776 -0.267975 -0.212748 0.197006 0.200321 0.237370 0.216233 0.226118 0.201352 0.211408 0.231317 0.202841 0.236679 0.213010 0.225464 0.225631 0.352131
chargesum: 0.00000
title: Mulliken charges with hydrogens summed into heavy atoms:
elementType: O C C C C C C C C C C
charge: -0.094651 0.169263 -0.115149 0.362080 -0.049845 -0.066455 0.131436 -0.121284 -0.185766 -0.042511 0.012883
polarizability: 1.29447449e+02 -2.20975542e+00 1.19100996e+02 -1.44466034e+01 -2.11704903e+00 7.44080228e+01
1716.lowfreq: -13.3374 -6.6881 -0.0002 0.0004 0.0005 13.5732 53.1249 89.9906 93.9283
frequency: 52.9090 89.9366 93.9138 185.9263 204.8623 239.3573 245.1259 277.5533 347.3408 362.5309 377.0043 404.8483 436.5939 488.3685 522.3244 555.1873 613.8125 705.0891 751.1675 763.3583 780.7497 832.2862 842.3494 883.2419 921.5366 927.5468 956.5738 962.1938 969.3176 1036.5375 1060.7141 1090.2257 1102.7745 1154.9979 1169.7000 1179.1054 1212.4438 1228.0376 1240.5432 1274.5773 1310.0173 1333.4859 1350.9981 1376.1779 1393.0217 1396.3286 1436.3872 1461.3990 1463.8688 1473.4679 1479.9247 1488.2862 1493.3574 1600.1373 1612.9032 2958.0895 2967.9917 2976.2515 2988.5484 3055.6783 3062.2487 3065.6449 3072.0030 3083.5314 3106.7644 3124.8479 3141.1055 3163.8843 3579.1802
redmass: 3.0304 3.4425 3.0708 3.7508 1.1638 2.1885 1.2254 3.4731 1.1538 2.1610 2.1584 2.7646 2.8932 3.5291 4.0943 5.1209 3.6069 3.8213 1.3875 3.4496 3.3711 3.0706 1.5512 1.5999 1.2117 1.3984 1.8849 1.6077 1.3354 2.2026 2.2266 1.4838 1.6663 1.2677 1.0618 1.9655 2.1650 1.4028 2.3568 1.5009 1.3494 1.4713 1.3665 1.2251 4.3006 1.3494 2.3226 1.0515 1.0985 1.0550 1.0961 1.0559 2.3493 6.3204 6.7240 1.0804 1.0363 1.0363 1.0646 1.0990 1.0992 1.0999 1.0992 1.0994 1.0885 1.0875 1.0925 1.1004 1.0659
irintensity: 0.0075 1.2655 0.9191 0.1736 0.2111 1.7307 0.7074 12.6145 119.0160 0.3157 4.9327 2.2161 6.2478 6.5825 6.2230 0.5174 4.8895 5.9642 92.4043 5.3286 4.4652 14.0481 1.9258 9.7782 0.7784 2.5887 0.6470 0.2758 0.0361 6.8161 33.4146 5.4708 102.8579 37.6223 0.9398 13.0632 10.6249 5.8188 37.4233 16.7734 18.4225 5.4554 2.9762 23.1762 6.2797 13.8361 34.8808 4.6660 2.7006 0.2208 29.5415 17.3155 19.6699 19.1771 3.2850 30.5454 31.3578 35.1420 47.1154 8.0446 39.8203 8.8495 107.4453 35.5244 16.8912 4.3940 25.3754 23.8137 24.9626
temp: 298.150 k
press: 1.00000 atm
elementType: 8 6 6 6 6 6 6 6 6 6 6 1 1 1 1 1 1 1 1 1 1 1 1 1 1
symmnumber: 1
zpe: 559602.3 jmol-1
zpe.correction: 0.213141 hartree
zpe.thermalcorrener: 0.224410 hartree
zpe.thermalcorrenthalpy: 0.225355 hartree
zpe.thermalcorrgfe: 0.176478 hartree
zpe.sumelectzpe: -463.847056 hartree
zpe.sumelectthermal: -463.835787 hartree
zpe.sumelectthermalent: -463.834843 hartree
zpe.sumelectthermalfe: -463.883720 hartree
dipole: 0.9905 0.6227 -0.4085
dipole: 1.2392
quadrupole: -61.9380 -59.9779 -70.1836
quadrupole: 4.3467 -3.5314 -2.0137
quadrupole: 2.0952 4.0552 -6.1504 4.3467 -3.5314 -2.0137
hfenergy: -464.0601975 hartree
pointgroup: C01 [X(C10H14O1)]
dipole: -0.3766518 0.2720765 0.1477125 debye
dipolederiv: -0.2734999 -0.3995879 -0.0582878 -0.3652289 -1.144481 0.153909 -0.0886387 0.1737514 -0.3732432 0.2561611 -0.0025104 0.0020722 -0.032925 0.1697404 -0.0080148 0.1365682 -0.0165137 0.1406108 -0.0542568 -0.0129437 -0.0203606 0.0413352 0.0549319 0.0114697 -0.1357743 0.0382703 0.0931468 0.2591399 0.0876395 -0.0842083 -0.1383661 -0.2548269 0.0601188 -0.1648975 -0.024678 -0.0848854 0.0408738 0.0016076 -0.0111938 0.0292749 -0.0456309 -0.0701534 -0.0227283 -0.0541295 -0.0250172 0.0187576 0.0167723 -0.0247654 0.0071901 -0.0760893 0.0649067 -0.0609302 0.0615632 0.0259658 0.1164853 0.3298352 -0.0293096 0.3604142 1.0647472 -0.1298066 0.0192561 -0.120946 0.0613455 0.03273 -0.0117793 -0.0753486 -0.008605 0.1137326 0.006706 -0.0743373 0.0041936 -0.1064054 -0.1093302 -0.2618756 -0.0364925 -0.0019316 -0.1130424 0.0094347 -0.0399596 0.1125377 -0.178397 -0.1756498 0.0360403 -0.0153041 0.1121979 -0.0000959 -0.0158072 -0.0046678 -0.003756 -0.1836863 0.0377148 0.0410363 -0.0924844 -0.1059711 0.0884047 0.0371224 -0.0854164 -0.005959 -0.1097188 -0.2104101 -0.0290426 0.1213959 -0.0287678 0.015269 0.0235941 0.0862457 0.0229831 -0.046595 -0.0081835 -0.0045884 0.0176872 0.0201277 -0.0404367 -0.1693393 0.0437531 -0.0957419 -0.059603 0.0257887 0.0019421 0.0045386 -0.0318274 -0.0517413 0.1226303 0.0177051 0.0652977 0.0364978 -0.0546656 -0.0125822 0.1354219 -0.049889 0.0496575 0.0260368 0.128762 0.0065691 0.0060937 0.1217515 0.0329187 0.0051801 0.0100613 -0.1368521 0.0487927 0.0204715 0.0837618 0.0479717 -0.1263145 -0.0136871 -0.1510586 0.0327412 0.0884441 0.0073421 -0.1559794 -0.022659 -0.0378932 -0.1224794 0.0562754 -0.1346743 0.0111648 0.0768316 0.0147451 -0.155405 0.0448015 -0.0118034 -0.0412507 -0.0676151 0.1236356 -0.0289774 0.0542743 0.0127592 0.1349725 0.0176344 0.0142997 0.1020774 -0.0100099 0.0018312 0.0101441 -0.0830432 -0.1115523 0.0308513 -0.1544732 -0.0626295 0.0403615 0.1027982 0.0583885 0.0934247 -0.0347116 -0.0347727 0.0583333 -0.0464196 0.1057772 0.0449662 0.0608317 0.0471911 0.0959593 -0.106796 -0.0423794 0.0554032 -0.0347514 0.1474797 0.0495381 -0.0755867 0.038696 -0.0937786 -0.0902722 0.0176922 0.0472876 0.0154257 0.1521021 -0.0962251 -0.0203805 0.098318 -0.013821 0.0858894 0.0018314 0.1050467 0.0059449 0.1191047 0.1259196 0.1544921 0.0791316 0.0760536 0.3160969 -0.0372653 0.1040781 -0.0727073 0.3294818 unknown
polarizability: 129.96475|1.1103882|119.0295768|-13.7550457|1.4557538|73.9621404 unknown
InChI: InChI=1S/C10H14O/c1-8(2)7-9-5-3-4-6-10(9)11/h3-6,8,11H,7H2,1-2H3
charge 0 multiplicity 1
25 atoms
O  -0.284368 2.282159 -0.390734
C  2.459464 -0.133605 -0.068148
C  1.291195 0.008548 -1.103536
C  -0.111935 -0.125735 -0.531686
C  2.376613 0.923857 1.057563
C  2.557299 -1.559236 0.524602
C  -0.879213 1.018849 -0.176323
C  -0.724939 -1.390859 -0.349303
C  -2.186719 0.902972 0.352949
C  -2.028476 -1.528401 0.180773
C  -2.760872 -0.373921 0.536048
H  3.389912 0.055736 -0.645491
H  1.435405 -0.764474 -1.884335
H  1.387495 0.995488 -1.590571
H  1.475414 0.762729 1.677977
H  2.317343 1.94571 0.643015
H  3.261221 0.860975 1.719021
H  3.445387 -1.647819 1.177942
H  1.666044 -1.796456 1.134323
H  2.642708 -2.32418 -0.271019
H  -0.163706 -2.286125 -0.642439
H  -2.755467 1.80523 0.616569
H  -2.468543 -2.523066 0.307606
H  -3.773126 -0.460927 0.945777
H  -0.909738 3.00545 -0.136882
