program: Gaussian 09
title: 000093368
version: EM64L-G09RevD.01
frameworkgroup: C1[X(C13H11N5O9S2)]
method: RPBEPBE
basis: SDD
operation: Freq
keyword: #p
keyword: freq=noraman
keyword: PBEPBE/SDD
title: #p freq=noraman PBEPBE/SDD
converged: YES YES NO NO
title: Mulliken charges:
elementType: S S O O O O O O O O O N N N N N C C C C C C C C C C C C C H H H H H H H H H H H
charge: 0.987818 0.990150 -0.243101 -0.190231 -0.552238 -0.558500 -0.469344 -0.521032 -0.499381 -0.480026 -0.254694 -0.216703 -0.660730 -0.342314 -0.383733 -0.509554 0.199802 0.417052 0.204185 0.175993 0.417793 -0.421462 -0.407934 -0.363021 -0.141331 -0.361318 0.075547 0.114556 0.289913 0.317464 0.263282 0.321549 0.386153 0.344633 0.339478 0.391228 0.390850 0.330421 0.312821 0.305958
chargesum: 0.00000
title: Mulliken charges with hydrogens summed into heavy atoms:
elementType: S S O O O O O O O O O N N N N N C C C C C C C C C C C C C
charge: 0.987818 0.990150 -0.243101 -0.190231 -0.161009 -0.167650 -0.469344 -0.521032 -0.499381 -0.480026 -0.254694 -0.216703 0.070056 -0.002836 -0.053312 0.109225 0.199802 0.417052 0.204185 0.175993 0.417793 -0.421462 -0.090470 -0.099740 -0.141331 -0.039769 0.075547 0.114556 0.289913
polarizability: 3.76678906e+02 -8.35843160e+00 3.55050617e+02 1.20742718e+01 5.83012401e+00 1.55583051e+02
1716.lowfreq: -3.5932 -2.3749 -0.0021 -0.0014 -0.0006 2.8935 22.0815 28.2861 30.8670
frequency: 22.0503 28.2817 30.8329 33.1007 46.8717 55.3010 66.8315 80.1838 95.5757 109.9816 119.3331 122.1024 153.8896 157.6565 172.0625 180.4237 187.2306 194.1273 207.4844 208.7208 217.9306 230.6898 246.7815 251.1998 277.8317 285.5798 299.8931 307.5265 309.1242 318.1006 340.4366 346.9149 361.6890 366.7543 383.2028 400.1673 403.7440 430.8870 441.5919 466.4444 478.9479 492.5517 500.2472 519.9834 533.0300 546.2610 550.9803 572.9328 589.1950 606.8746 625.7323 663.4975 681.6138 692.5242 699.8519 718.8754 747.4181 759.6101 776.7951 795.0979 800.2296 818.3330 833.1378 857.2038 870.1535 896.0905 933.6735 950.8733 961.3311 968.6560 971.3429 981.0067 1000.0771 1050.1287 1054.0612 1058.9581 1076.1778 1106.4438 1148.2473 1182.9518 1207.2983 1221.1109 1243.2173 1257.5442 1289.7910 1291.9665 1341.3250 1375.6357 1383.8217 1418.8706 1434.7383 1439.6742 1464.9059 1477.2211 1536.0093 1557.4651 1580.2827 1592.7737 1608.4895 1624.4231 1663.1022 1665.0690 1683.4526 3142.5816 3144.8600 3160.6997 3306.7889 3406.9680 3474.4868 3474.6869 3478.6775 3529.3124 3547.1925 3635.2391
redmass: 6.7522 8.3978 9.3920 8.4413 7.7081 7.2161 6.9396 10.0847 6.9728 6.9649 8.4155 7.9871 4.9981 5.1926 4.7909 3.0632 3.4305 3.0503 2.1325 3.7366 1.8730 3.8153 4.2421 3.2238 6.3289 2.9068 3.4106 5.4690 4.0440 6.6830 7.3124 6.7601 6.6667 8.9139 10.9895 7.1513 9.4083 6.3720 3.8628 2.9414 9.2005 3.9067 2.3758 4.9892 4.1670 11.4815 1.5377 6.8240 5.3986 4.0276 5.2853 6.9895 4.8257 7.3881 5.4162 6.6915 1.7347 3.4591 3.9619 2.7548 3.0941 5.7666 11.3147 6.9691 2.5564 8.1449 2.0484 10.0030 1.5241 8.9735 1.6522 5.8547 3.6346 1.1976 1.2012 3.4683 3.0332 2.3838 3.2455 3.6515 2.4478 2.4376 1.6250 2.4201 1.6628 2.3691 5.6710 3.7316 5.3675 4.8192 1.7754 3.1579 1.8162 3.6177 6.8311 6.0269 11.0559 7.1870 8.9863 7.7811 2.5180 1.6193 1.2304 1.0912 1.0923 1.0932 1.0651 1.0427 1.0756 1.0661 1.0662 1.1000 1.0787 1.0874
irintensity: 0.2931 1.5800 0.4755 0.7914 1.3336 3.6388 2.6332 0.8392 1.3972 0.9282 0.6334 0.0396 14.2890 8.1190 9.9518 4.9376 14.5869 24.0297 15.0086 6.0781 21.2757 28.1722 12.8628 50.5921 8.1123 39.9570 77.1783 29.2843 56.6476 35.3291 13.6622 6.6430 8.2597 12.3544 94.7781 23.8593 65.4965 34.1947 68.9077 1.8383 21.1851 18.1003 17.0718 85.9453 133.2187 111.6604 147.1192 74.0190 50.9215 52.6247 28.8154 7.1011 1.7675 15.3862 5.6832 0.2446 179.9955 32.4036 20.2631 36.8004 93.2452 78.8399 45.0063 42.9011 62.9886 17.2231 2.5512 57.3108 10.7338 71.9014 9.7999 19.2652 46.6875 93.9674 81.4202 34.8013 19.4886 72.3792 55.2184 56.1590 211.4460 33.5189 146.8274 132.0737 14.2938 19.3076 64.9573 44.0129 8.1709 18.5771 20.0802 123.4328 322.9169 12.1381 97.9070 43.7246 207.2198 282.9680 161.6114 125.2610 94.5323 354.0107 2.1413 6.0613 16.7267 14.9858 336.4694 0.2916 43.8208 60.2705 61.4529 3.3239 56.3291 65.3940
temp: 298.150 k
press: 1.00000 atm
elementType: 16 16 8 8 8 8 8 8 8 8 8 7 7 7 7 7 6 6 6 6 6 6 6 6 6 6 6 6 6 1 1 1 1 1 1 1 1 1 1 1
symmnumber: 1
zpe: 668050.4 jmol-1
zpe.correction: 0.254447 hartree
zpe.thermalcorrener: 0.283425 hartree
zpe.thermalcorrenthalpy: 0.284369 hartree
zpe.thermalcorrgfe: 0.193440 hartree
zpe.sumelectzpe: -2246.432633 hartree
zpe.sumelectthermal: -2246.403655 hartree
zpe.sumelectthermalent: -2246.402711 hartree
zpe.sumelectthermalfe: -2246.493640 hartree
dipole: 1.8054 -0.7582 1.6558
dipole: 2.5644
quadrupole: -177.6726 -197.8959 -182.4822
quadrupole: 10.1596 10.8761 4.7448
quadrupole: 8.3443 -11.8790 3.5347 10.1596 10.8761 4.7448
hfenergy: -2246.6870797 hartree
pointgroup: C01 [X(C13H11N5O9S2)]
dipole: -0.5853445 0.502973 0.6498162 debye
polarizability: 369.8768914|-13.481973|360.6329539|-18.3293801|-9.1024969|156.8027297 unknown
InChI: InChI=1S/C13H11N5O9S2/c14-10-5-1-4(28(22,23)24)2-6-9(5)7(3-8(10)29(25,26)27)12(20)18(11(6)19)17-13(21)16-15/h1-3,16-17,22,25H,14-15H2
charge 0 multiplicity 1
40 atoms
S  -2.878924 3.923675 0.014455
S  -2.278182 -4.216304 0.205318
O  2.264272 2.56598 -0.850401
O  2.66828 -2.084139 -0.745812
O  -2.584105 4.165274 1.826131
O  -1.801563 -4.429692 1.981297
O  -2.140922 5.104507 -0.796894
O  -4.475628 3.665539 -0.203761
O  -3.882831 -4.032922 0.096376
O  -1.503532 -5.326222 -0.675914
O  4.188176 -0.26377 1.361029
N  2.436458 0.248678 -0.722115
N  -3.968999 0.981733 0.237045
N  3.823586 0.389646 -0.899951
N  5.995039 0.138012 -0.087813
N  6.999556 -0.11822 0.876626
C  -0.360312 0.006849 -0.273289
C  -1.777965 -0.125082 -0.040933
C  0.230704 1.300573 -0.441149
C  0.457729 -1.167802 -0.361662
C  -2.62236 1.070461 0.039221
C  -1.95196 2.317984 -0.12792
C  -0.57172 2.444316 -0.357914
C  -2.328612 -1.427761 0.112466
C  -1.48288 -2.529674 0.022521
C  -0.098123 -2.446102 -0.2087
C  1.677168 1.45878 -0.670864
C  1.92597 -1.078197 -0.623751
C  4.641914 0.064637 0.235388
H  -0.110628 3.430944 -0.484251
H  -3.394759 -1.613935 0.28231
H  0.544578 -3.329288 -0.285937
H  -4.54154 1.841061 0.19349
H  -4.430931 0.085336 0.368099
H  4.048086 1.24025 -1.43155
H  -2.913397 5.078458 2.07543
H  -1.974787 -5.382727 2.236857
H  6.298175 0.102619 -1.0622
H  6.81369 -0.996898 1.379988
H  7.09838 0.672323 1.526034
