program: Gaussian 09
title: 000093119
version: EM64L-G09RevD.01
frameworkgroup: C1[X(C14H26O2)]
method: RPBEPBE
basis: SDD
operation: Freq
keyword: #pfreq=noraman
keyword: PBEPBE/SDD
title: #p freq=noraman PBEPBE/SDD
converged: YES YES NO NO
title: Mulliken charges:
elementType: O O C C C C C C C C C C C C C C H H H H H H H H H H H H H H H H H H H H H H H H H H
charge: -0.256607 -0.250818 -0.380949 -0.372530 -0.378718 -0.377931 -0.393364 -0.457205 -0.281843 -0.198717 -0.193797 -0.430620 -0.347184 -0.688418 0.285850 -0.751634 0.196600 0.195523 0.191416 0.194393 0.194930 0.195546 0.210320 0.194735 0.212699 0.212459 0.196535 0.204118 0.227617 0.227979 0.224607 0.222300 0.200746 0.191827 0.210730 0.195338 0.216981 0.210682 0.208239 0.244506 0.246817 0.246839
chargesum: 0.00000
title: Mulliken charges with hydrogens summed into heavy atoms:
elementType: O O C C C C C C C C C C C C C C
charge: -0.256607 -0.250818 0.011175 0.013279 0.011759 0.027124 0.031795 -0.056552 0.173753 0.025890 0.028503 -0.038047 0.058884 -0.052515 0.285850 -0.013471
polarizability: 2.27363869e+02 -7.26391785e+00 1.37403456e+02 5.20378301e+00 3.96009526e+00 1.28403282e+02
1716.lowfreq: -34.4686 -17.6391 -4.7455 -0.0010 0.0005 0.0012 3.9586 15.8723 19.2720
frequency: -34.4526 11.1518 18.9678 23.8158 39.1504 48.0795 64.6961 73.6979 84.2436 93.1549 111.2613 127.1909 139.2442 142.3322 160.3751 189.4224 190.5758 229.4016 240.6330 284.6142 324.3881 339.4472 391.3435 428.5772 455.3963 489.9067 540.6059 567.0484 614.2845 721.3532 733.9791 739.0990 761.4936 793.0138 817.5130 832.4937 861.2499 885.7120 899.0858 934.6277 961.8784 978.6944 993.1769 1000.4374 1004.2787 1013.6520 1041.5075 1044.8107 1052.1062 1059.3120 1070.9815 1079.1929 1094.7537 1100.9479 1105.4600 1150.0557 1165.3425 1205.2123 1207.5357 1210.9186 1222.7729 1244.8151 1251.0496 1263.9993 1271.4555 1275.0515 1279.9424 1289.6039 1291.4114 1293.1657 1299.3096 1315.5808 1333.1581 1343.9610 1351.3802 1359.4370 1372.4723 1382.9702 1388.7915 1453.1309 1454.8722 1457.5963 1459.8968 1462.1641 1464.7757 1468.6454 1472.8916 1474.7727 1476.9421 1483.1290 1485.7389 1489.7769 1648.8558 1685.0833 2948.4085 2949.9594 2951.8849 2954.6755 2961.3780 2967.8978 2971.2124 2974.6917 2987.4582 2989.4213 2997.8192 2999.3950 3006.9771 3007.5180 3007.7348 3023.9446 3032.8942 3039.7000 3046.0894 3058.1815 3067.1439 3070.4810 3071.8451 3073.6140 3095.6954 3142.8234
redmass: 1.0361 4.2216 5.4951 3.0547 3.2670 3.0529 1.8507 2.1058 2.9901 2.5861 2.1283 2.5607 2.0585 2.6255 4.9367 2.7362 2.3294 1.1294 3.1138 3.4581 2.9210 3.3698 3.3663 3.0696 3.2546 3.1289 2.4481 2.9891 4.8651 1.0653 1.0943 1.1066 1.1537 1.5898 1.3199 6.0293 1.3570 1.5602 1.4620 5.1103 1.3841 1.2068 3.4893 1.6891 2.4794 2.7605 1.6694 2.8279 2.8793 1.6091 2.2388 2.1563 2.0532 2.4846 3.2701 1.4788 1.9306 1.4555 3.5477 1.2846 1.3456 1.2870 1.2898 1.2861 1.1683 1.1258 1.0882 1.1522 1.2081 1.1429 1.1909 1.2985 1.4107 1.4898 1.5382 1.6164 1.4518 1.3277 1.2146 1.0635 1.0472 1.0862 1.0852 1.0706 1.0787 1.0806 1.0605 1.0935 1.0444 1.0963 1.0754 1.0979 9.1847 6.6101 1.0613 1.0617 1.0593 1.0591 1.0599 1.0600 1.0362 1.0607 1.0965 1.0600 1.0984 1.0566 1.0973 1.0367 1.0971 1.1034 1.1013 1.1037 1.1045 1.0942 1.0932 1.0960 1.0986 1.1077 1.0974 1.1010
irintensity: 1.0883 0.0768 1.3768 0.0519 0.3458 0.1477 0.1541 0.6105 0.1848 0.1941 0.2252 0.5715 0.4289 0.6120 1.0618 6.6442 1.5530 0.0167 3.5315 4.7752 1.6190 3.5696 2.1335 0.5533 6.4974 0.2123 0.1735 2.6739 4.6850 12.3216 0.3433 8.1032 2.5984 0.3292 0.7875 17.8817 0.9233 3.0004 5.0270 33.6305 19.9790 37.3610 9.0178 12.5514 98.4168 2.0180 9.6706 7.6936 8.2571 13.5194 7.2655 0.3998 7.8079 6.2340 5.8910 1.5635 1.1289 2.0592 398.7990 2.1930 2.3464 1.2084 4.4631 0.2172 0.8220 0.0160 0.1260 0.6943 1.0874 0.1445 0.4940 1.9017 0.6537 1.2660 0.1590 0.1519 15.7933 39.8427 10.4513 28.6614 17.9501 2.3947 3.2026 0.1099 0.4694 0.6997 3.4201 2.1833 12.1845 2.4281 15.1581 26.6812 204.1061 0.0122 16.3166 30.4015 12.2948 0.3127 9.3221 122.1382 56.5349 30.0344 1.3150 16.9544 1.5998 43.6460 8.4733 4.5329 1.0342 3.2532 18.0784 43.6851 76.2138 2.3826 24.2801 129.0875 60.5043 93.0850 9.4174 11.9005
temp: 298.150 k
press: 1.00000 atm
elementType: 8 8 6 6 6 6 6 6 6 6 6 6 6 6 6 6 1 1 1 1 1 1 1 1 1 1 1 1 1 1 1 1 1 1 1 1 1 1 1 1 1 1
symmnumber: 1
zpe: 972625.7 jmol-1
zpe.correction: 0.370454 hartree
zpe.thermalcorrener: 0.390824 hartree
zpe.thermalcorrenthalpy: 0.391768 hartree
zpe.thermalcorrgfe: 0.316096 hartree
zpe.sumelectzpe: -698.217664 hartree
zpe.sumelectthermal: -698.197293 hartree
zpe.sumelectthermalent: -698.196349 hartree
zpe.sumelectthermalfe: -698.272021 hartree
dipole: -1.5572 1.3924 0.8469
dipole: 2.2541
quadrupole: -113.5350 -102.2667 -98.8383
quadrupole: 11.5396 8.8545 -1.9457
quadrupole: -8.6550 2.6133 6.0417 11.5396 8.8545 -1.9457
hfenergy: -698.5881171 hartree
pointgroup: C01 [X(C14H26O2)]
dipole: -0.6113751 0.550923 0.3304232 debye
polarizability: 227.313608|-7.4981113|137.4775019|5.3277104|3.901691|128.3794974 unknown
InChI: InChI=1S/C14H26O2/c1-3-4-5-6-7-8-9-10-11-12-13-16-14(2)15/h5-6H,3-4,7-13H2,1-2H3
charge 0 multiplicity 1
42 atoms
O  5.596297 0.731316 0.186611
O  7.209546 -0.660151 -0.759647
C  0.657868 -0.083221 0.346317
C  -0.5184 -1.020732 -0.006683
C  2.030951 -0.638786 -0.094228
C  -1.893768 -0.458172 0.416392
C  3.201232 0.309132 0.258515
C  -3.070044 -1.403785 0.052638
C  4.544915 -0.259505 -0.196684
C  -4.415872 -0.874634 0.503291
C  -5.467144 -0.604798 -0.314838
C  -6.80795 -0.056308 0.126973
C  -7.15741 1.300608 -0.543712
C  -8.557377 1.815832 -0.146662
C  6.90982 0.398667 -0.162043
C  7.866266 1.484564 0.283915
H  0.493299 0.906018 -0.129251
H  0.668759 0.096233 1.441576
H  -0.360697 -2.007481 0.477591
H  -0.521718 -1.209081 -1.100784
H  2.016132 -0.81987 -1.189219
H  2.195509 -1.62733 0.383031
H  -2.059706 0.526313 -0.065569
H  -1.896951 -0.274893 1.511076
H  3.230109 0.481905 1.351621
H  3.043402 1.295448 -0.218901
H  -2.878498 -2.391889 0.523863
H  -3.082815 -1.572543 -1.042594
H  4.778992 -1.224519 0.290573
H  4.587247 -0.410245 -1.291604
H  -4.52584 -0.691183 1.58529
H  -5.352654 -0.783533 -1.397323
H  -6.822381 0.062128 1.228701
H  -7.611344 -0.781802 -0.124755
H  -6.38656 2.04684 -0.268566
H  -7.101422 1.185037 -1.645273
H  -8.7854 2.781889 -0.633407
H  -8.630914 1.963092 0.94749
H  -9.343202 1.094367 -0.44098
H  8.893458 1.211254 0.003329
H  7.801669 1.622469 1.37712
H  7.594196 2.446349 -0.184289
