program: Gaussian 09
title: 000009579
version: EM64L-G09RevD.01
frameworkgroup: C1[X(C6ClF5)]
method: RPBEPBE
basis: SDD
operation: Freq
keyword: #pfreq=noraman
keyword: PBEPBE/SDD
title: #p freq=noraman PBEPBE/SDD
converged: NO NO NO YES
title: Mulliken charges:
elementType: Cl F F F F F C C C C C C
charge: 0.092816 -0.139533 -0.139525 -0.139892 -0.139882 -0.138685 -0.514090 0.386521 0.386472 0.110216 0.110222 0.125362
chargesum: 0.00000
title: Mulliken charges with hydrogens summed into heavy atoms:
polarizability: 1.07054797e+02 3.04229915e-05 8.53332191e+01 2.94768499e-03 -4.02805996e-04 2.92753565e+01
1716.lowfreq: -10.2598 -1.9708 -0.0005 0.0015 0.0021 5.1960 98.8941 121.0298 157.0268
frequency: 98.8853 121.0296 157.0267 188.2453 193.4550 255.0192 255.6514 284.9013 285.1745 337.7196 359.6973 372.7956 422.4728 484.6494 548.3606 608.8562 631.2172 714.0158 747.6514 816.9683 919.7439 1025.6480 1082.9346 1212.5253 1352.4206 1382.2680 1452.6875 1455.6682 1602.7951 1604.1625
redmass: 21.4265 18.5773 18.7215 24.0482 14.2736 18.8551 18.8615 18.0933 20.7099 12.6364 12.6405 19.8786 16.1275 17.5621 17.5249 12.1513 12.1747 12.6654 12.0589 14.1426 14.3343 13.5729 13.6307 12.7174 12.0014 12.5591 12.3557 12.2900 12.0244 12.0231
irintensity: 0.0188 0.0000 0.0306 0.0021 2.8367 0.0375 0.0106 1.1952 1.3950 1.0209 0.0000 0.2144 0.0010 0.6424 0.0166 1.6921 0.0000 0.0028 2.1260 115.4583 146.5720 28.8448 0.2830 0.6225 0.0035 5.4138 183.2336 285.1686 0.0706 0.6495
temp: 298.150 k
press: 1.00000 atm
elementType: 17 9 9 9 9 9 6 6 6 6 6 6
symmnumber: 1
zpe: 125456.2 jmol-1
zpe.correction: 0.047784 hartree
zpe.thermalcorrener: 0.058179 hartree
zpe.thermalcorrenthalpy: 0.059123 hartree
zpe.thermalcorrgfe: 0.011274 hartree
zpe.sumelectzpe: -1186.992149 hartree
zpe.sumelectthermal: -1186.981754 hartree
zpe.sumelectthermalent: -1186.980810 hartree
zpe.sumelectthermalfe: -1187.028659 hartree
dipole: -0.6949 0.0000 0.0011
dipole: 0.6949
quadrupole: -76.4577 -80.6000 -68.9404
quadrupole: -0.0004 0.0009 -0.0002
quadrupole: -1.1250 -5.2673 6.3923 -0.0004 0.0009 -0.0002
hfenergy: -1187.0399332 hartree
pointgroup: C01 [X(C6Cl1F5)]
dipole: 0.273378 -0.0004425 -0.0004154 debye
dipolederiv: -0.5424508 0.0008579 -0.0000576 0.0008637 -0.00271 -0.0000007 -0.0000194 -0.0000103 0.0457139 -0.2946115 0.3301291 -0.0000519 0.275082 -0.751279 0.0000939 -0.0001895 0.0003689 -0.0906607 -0.296496 -0.3315546 -0.0000441 -0.2765051 -0.7494092 -0.0000799 -0.0001341 -0.0002926 -0.0906541 -0.3914336 0.3476857 0.0000566 0.3797075 -0.7429111 -0.0000994 0.0001526 -0.0003069 -0.0776634 -0.3937089 -0.34878 0.0000618 -0.3808192 -0.740657 0.0001066 0.0002413 0.000422 -0.0776547 -0.9984801 0.0013125 0.0001148 0.001313 -0.1546359 -0.0000022 0.0003635 -0.0000164 -0.0777038 0.8709293 -0.0016475 0.0000972 -0.0016341 -0.1649736 0.0000159 -0.0000968 0.0000259 -0.1268022 0.134432 -0.4851177 0.0001505 -0.271124 0.8425803 -0.0001677 0.0002561 -0.0004138 0.1447331 0.1368183 0.4873401 0.0001206 0.2733278 0.8402598 0.0001379 0.0001673 0.0003305 0.1447392 0.3263301 -0.5047172 -0.0000942 -0.4554763 0.7720608 0.000164 -0.0001309 0.0003147 0.057128 0.3293559 0.5061017 -0.0001185 0.4568822 0.7691013 -0.0001943 -0.0002556 -0.000465 0.057134 1.1193153 -0.0016101 -0.0002354 -0.0016177 0.0825735 0.0000259 -0.0003544 0.0000432 0.0916906 unknown
polarizability: 107.0547419|-0.034549|85.3332741|0.0029483|0.0003981|29.2753565 unknown
InChI: InChI=1S/C6ClF5/c7-1-2(8)4(10)6(12)5(11)3(1)9
charge 0 multiplicity 1
12 atoms
Cl 3.177662 -0.005033 0.000157
F  1.34293 -2.426538 0.000311
F  1.350485 2.42236 0.000253
F  -1.425979 2.421709 0.000229
F  -1.433525 -2.41726 0.000295
F  -2.827047 0.004397 0.000239
C  1.390351 -0.002172 -0.00012
C  0.670336 -1.216089 -0.000282
C  0.674153 1.214001 -0.000228
C  -0.736097 1.220908 -0.000249
C  -0.739914 -1.21863 -0.000335
C  -1.443256 0.002248 -0.000269
