program: Gaussian 09
title: 000093047
version: EM64L-G09RevD.01
frameworkgroup: C1[X(C9H12N2)]
method: RPBEPBE
basis: SDD
operation: Freq
keyword: #pfreq=noraman
keyword: PBEPBE/SDD
title: #p freq=noraman PBEPBE/SDD
converged: YES YES NO NO
title: Mulliken charges:
elementType: N N C C C C C C C C C H H H H H H H H H H H H
charge: -0.379716 -0.001340 -0.154362 -0.476109 -0.412533 -0.414047 0.442448 -0.326187 -0.520987 -0.190838 -0.337352 0.208433 0.240604 0.218246 0.217077 0.227018 0.188182 0.221095 0.257620 0.279521 0.246012 0.227590 0.239624
chargesum: 0.00000
title: Mulliken charges with hydrogens summed into heavy atoms:
elementType: N N C C C C C C C C C
charge: -0.122096 -0.001340 0.054071 -0.017260 0.031562 -0.004769 0.442448 -0.046666 -0.274974 0.036752 -0.097727
polarizability: 1.41471898e+02 1.74180289e+00 9.86222432e+01 2.94538496e+00 6.62886068e+00 7.17011193e+01
1716.lowfreq: 0.0004 0.0006 0.0009 4.0399 8.7837 14.8062 42.4654 53.6317 108.2848
frequency: 42.2942 53.4770 108.2399 117.8653 245.3115 279.0873 327.4132 400.0877 510.3593 547.5234 605.2771 620.7714 661.1452 724.2506 729.5746 798.6320 819.1922 833.2872 902.2578 918.0365 927.2086 933.4773 947.6163 984.8618 1000.3965 1006.7843 1028.2196 1045.6762 1093.4114 1104.7360 1120.3511 1165.9712 1187.6928 1193.8487 1222.1699 1230.0731 1248.9661 1282.9858 1286.1522 1306.3851 1314.8983 1334.8422 1358.5780 1401.7158 1419.1254 1459.0040 1466.2656 1481.0674 1497.8483 1558.6510 1586.1219 2846.6251 2888.0621 3014.2200 3026.1448 3037.9226 3071.1398 3094.4401 3106.9072 3127.2719 3144.1093 3163.9334 3463.8748
redmass: 2.2824 2.4907 3.3337 2.9755 3.2988 3.3519 5.2120 3.2364 2.9703 2.2552 7.3972 2.6564 5.8153 1.8702 1.7265 1.6613 1.6993 2.9088 2.6508 1.9091 1.4438 2.1422 1.5125 2.1562 1.4676 3.5390 2.8111 1.9839 2.0597 1.8485 3.2387 1.2544 1.3475 1.3481 1.1987 1.6523 1.2391 1.2180 1.3566 3.0449 2.0349 1.3588 1.3505 1.4015 1.9944 2.2066 1.0904 1.0879 1.0945 5.5595 6.0339 1.0815 1.0718 1.0589 1.0656 1.0873 1.1041 1.1054 1.0909 1.0878 1.0915 1.0999 1.0756
irintensity: 0.6954 1.6449 1.1419 2.9483 1.3172 0.6390 0.3653 2.8711 27.5917 33.9909 4.1239 19.2938 1.9082 21.9093 45.0480 15.5529 35.5481 8.8113 3.6621 5.8721 1.5752 3.1270 2.2371 4.3852 0.0878 8.1951 1.1981 2.8798 3.0169 11.4073 30.8955 0.4744 1.4615 6.3264 1.1700 2.5999 20.2315 21.3488 0.6591 3.3098 14.2686 6.9485 2.4971 10.2314 16.0181 21.5684 4.1774 9.6521 0.3119 8.3594 0.6521 66.7862 142.5618 28.9913 44.2421 47.6396 5.8089 52.5569 31.1055 6.6469 15.5051 23.3409 0.1004
temp: 298.150 k
press: 1.00000 atm
elementType: 7 7 6 6 6 6 6 6 6 6 6 1 1 1 1 1 1 1 1 1 1 1 1
symmnumber: 1
zpe: 510948.0 jmol-1
zpe.correction: 0.194610 hartree
zpe.thermalcorrener: 0.204145 hartree
zpe.thermalcorrenthalpy: 0.205089 hartree
zpe.thermalcorrgfe: 0.158492 hartree
zpe.sumelectzpe: -458.820596 hartree
zpe.sumelectthermal: -458.811060 hartree
zpe.sumelectthermalent: -458.810116 hartree
zpe.sumelectthermalfe: -458.856713 hartree
dipole: -2.8228 1.1797 -0.0601
dipole: 3.0600
quadrupole: -67.1815 -65.3624 -64.9710
quadrupole: 8.5627 3.1566 0.6341
quadrupole: -1.3432 0.4759 0.8673 8.5627 3.1566 0.6341
hfenergy: -459.0152054 hartree
pointgroup: C01 [X(C9H12N2)]
dipole: -1.1132144 0.3539213 -0.291272 debye
dipolederiv: -0.7310998 -0.0721457 -0.0570301 -0.0927927 -0.4663389 0.1251062 -0.0015213 0.163499 -0.371454 -0.3933666 0.004137 -0.0127496 -0.0071182 -0.3238003 0.0267984 -0.011987 0.0251672 -0.2499785 0.2568291 0.0040417 0.1432757 0.0994958 0.4058494 -0.0343751 0.3488346 -0.0814466 0.3179284 -0.0607893 0.021307 0.0697366 0.0408638 0.0932272 -0.0594984 -0.1108363 -0.076287 0.0511696 0.012816 0.0135506 -0.0749261 0.0110064 0.1565225 -0.0288644 0.0373274 -0.0293047 -0.0278902 0.5905591 0.0697472 0.0355872 0.0490533 0.3627453 0.0138024 -0.1378666 -0.0149515 0.101651 0.291166 0.0707556 -0.0881556 -0.0069393 -0.2150843 0.068524 -0.0622058 0.0516096 -0.0362833 -0.0184508 -0.031213 0.0355396 -0.0811377 0.0563338 -0.0497202 0.0569337 -0.055554 -0.0963545 0.0137276 -0.0424797 0.0389245 0.112682 0.271724 -0.1092413 -0.0326138 -0.1313914 -0.0545534 -0.1871628 0.0345573 -0.0176298 0.1553579 0.0573047 -0.0468393 -0.0589175 -0.0576314 -0.0937674 0.3227377 0.0955108 0.0099913 -0.0506084 0.0768271 -0.0579419 0.0562241 -0.0449983 -0.0732223 -0.0231519 -0.0074416 -0.0204532 0.0126168 -0.2645606 0.0524485 -0.0534702 0.0326952 -0.0244403 0.0095425 -0.0714526 -0.0445662 -0.0918342 -0.0783742 -0.0728182 -0.0418836 -0.0120201 0.0557896 0.0432424 0.0290346 -0.0379625 0.0072436 0.0040418 0.1352903 -0.023733 0.0822921 -0.0874345 -0.0793797 -0.0707602 0.0775112 -0.1267665 -0.0108526 0.0764532 0.0748036 0.0471631 0.0108271 0.0032333 0.0499057 0.0216965 0.1177642 -0.1152509 -0.074999 0.0053593 -0.0403927 0.044645 -0.1460276 -0.0828385 -0.0224548 -0.2346748 -0.2012006 -0.0854774 0.0160596 -0.0387414 0.0146358 -0.0972581 0.0657448 -0.0759261 0.1152014 -0.0215828 0.1076791 -0.0955812 0.0667015 -0.0049331 0.1357774 0.0555458 0.0165051 0.1102099 0.2259334 -0.1538468 0.0257094 -0.0629413 0.0307815 0.0920894 0.0891691 -0.0286125 0.0957997 0.0464564 0.0300936 -0.0253738 0.0371856 0.1182345 0.0495236 -0.090637 0.0177468 -0.0935756 -0.063254 0.051029 0.0232535 0.0517327 0.1096184 0.0491859 -0.0652653 0.0136273 -0.0966048 -0.0744603 0.0699681 0.0156751 0.0726063 0.1321077 -0.1337432 -0.0687736 0.0003249 -0.0452427 0.0777937 0.0164293 -0.0041904 0.0150081 0.1329229 unknown
polarizability: 141.3690194|3.7228379|96.1320637|1.9474606|-10.2833573|74.2941776 unknown
InChI: InChI=1S/C9H12N2/c1-3-8(7-10-5-1)9-4-2-6-11-9/h1,3,5,7,9,11H,2,4,6H2
charge 0 multiplicity 1
23 atoms
N  -1.769929 0.072645 -1.099477
N  2.766085 -0.957456 0.423993
C  -1.030572 -0.553728 0.026192
C  -1.789853 0.040856 1.254768
C  -3.260845 0.233834 0.763742
C  -3.214194 -0.021598 -0.775348
C  0.453768 -0.232011 -0.002246
C  0.923153 1.049608 -0.388196
C  1.420249 -1.192853 0.385941
C  2.308818 1.312986 -0.360903
C  3.190863 0.286716 0.054311
H  -1.149622 -1.666972 0.048292
H  -1.336052 1.011452 1.518905
H  -1.709918 -0.621515 2.13374
H  -3.954649 -0.469351 1.256193
H  -3.609779 1.256079 0.986549
H  -3.642558 -1.028455 -0.996704
H  -3.791748 0.725135 -1.348418
H  -1.507126 -0.277729 -2.029625
H  0.196369 1.8011 -0.71491
H  1.10827 -2.203987 0.67958
H  2.706085 2.290136 -0.654782
H  4.273686 0.453509 0.091603
