program: Gaussian 09
title: 000093065
version: EM64L-G09RevD.01
frameworkgroup: C1[X(C19H40)]
method: RPBEPBE
basis: SDD
operation: Freq
keyword: #p
keyword: freq=noraman
keyword: PBEPBE/SDD
title: #p freq=noraman PBEPBE/SDD
converged: YES YES NO NO
title: Mulliken charges:
elementType: C C C C C C C C C C C C C C C C C C C H H H H H H H H H H H H H H H H H H H H H H H H H H H H H H H H H H H H H H H H
charge: 0.010126 -0.439675 -0.402147 -0.412990 -0.375580 -0.388231 -0.386075 -0.392445 -0.385576 -0.758690 -0.385218 -0.350412 -0.381847 -0.372927 -0.357714 -0.353321 -0.356783 -0.696703 -0.696851 0.188641 0.195477 0.193786 0.203895 0.209245 0.197337 0.189731 0.190752 0.189384 0.193253 0.191440 0.193738 0.192805 0.199478 0.183421 0.192657 0.193799 0.213321 0.217270 0.211713 0.192564 0.193131 0.187637 0.185258 0.191981 0.191423 0.189307 0.189109 0.194563 0.194612 0.187389 0.187609 0.194690 0.194690 0.209676 0.214785 0.209553 0.209600 0.209598 0.214738
chargesum: 0.00000
title: Mulliken charges with hydrogens summed into heavy atoms:
elementType: C C C C C C C C C C C C C C C C C C C
charge: 0.198768 -0.050413 0.010994 -0.025922 0.004557 -0.003538 0.000468 -0.009546 0.000881 -0.116385 0.000477 0.022483 0.001557 0.005489 0.031461 0.021677 0.032596 -0.062689 -0.062915
polarizability: 2.65496926e+02 1.74474549e+00 1.89578457e+02 9.08467074e-01 7.08481401e-01 1.74824907e+02
1716.lowfreq: -3.3544 -0.0020 0.0003 0.0016 4.7016 9.8830 14.3565 25.9979 32.9117
frequency: 13.2862 25.9261 32.6560 37.5804 41.7038 53.2360 58.4490 65.7151 73.0091 90.5259 98.5464 108.2767 113.6689 122.3632 126.5127 130.2190 144.6730 152.9005 155.7179 161.2978 200.2418 204.4060 231.6069 235.0791 235.4729 256.8949 301.5149 316.9159 361.3509 381.7033 409.0724 425.5567 451.7128 481.4069 493.7085 585.1207 720.1767 721.6943 722.4232 726.2893 735.6013 746.7502 753.6733 785.6407 803.4168 828.7777 833.5993 880.4799 887.8558 892.5743 924.7518 935.5201 944.1670 965.5671 979.3647 983.6606 999.7340 1006.5858 1013.7955 1021.5625 1026.4789 1041.0698 1046.8711 1062.2733 1066.7590 1072.7054 1078.9153 1080.3268 1081.6164 1082.8358 1098.9233 1117.8593 1131.1837 1168.7422 1177.9938 1183.8102 1198.0665 1205.5778 1208.3237 1223.9224 1231.5551 1236.4511 1255.5919 1257.5433 1260.9870 1276.1524 1277.3599 1278.9520 1284.3245 1285.9810 1287.5030 1291.5429 1292.7785 1296.1230 1299.5444 1302.8587 1308.0245 1320.6270 1333.6267 1342.2367 1346.8613 1351.0644 1352.4149 1353.0514 1356.2336 1357.1545 1363.7737 1382.2853 1388.6733 1390.7465 1456.4782 1458.2275 1458.8865 1459.9926 1461.8344 1462.6405 1463.3047 1464.8716 1468.4661 1469.8856 1473.7278 1475.6159 1477.5438 1478.3139 1478.6509 1480.3978 1482.9337 1483.9688 1486.8749 1487.8622 1488.6114 2935.2979 2947.0402 2947.9847 2948.7177 2949.3797 2949.9738 2950.5681 2951.2973 2954.0980 2955.9415 2957.1814 2958.6075 2963.2724 2966.6350 2968.1892 2969.2442 2971.1404 2971.1752 2971.9989 2981.4910 2983.6357 2985.6882 2987.4611 2992.1169 2995.3856 2998.3820 3002.8408 3012.1797 3016.5724 3022.5841 3032.2830 3035.5042 3040.1132 3044.8441 3064.0985 3066.8002 3067.5765 3067.8431 3069.8436 3069.8601
redmass: 3.9459 3.5401 3.1307 1.6677 1.6517 2.6206 3.3856 1.6181 3.3734 3.0042 1.6113 1.9378 3.3788 2.0975 2.6108 1.7521 2.3535 3.2476 1.9433 2.0908 1.1965 2.9332 1.8827 1.1800 1.3592 3.2042 2.7516 3.1199 2.6863 2.7126 2.7082 3.0778 2.4928 3.1622 2.8960 2.7736 1.0580 1.0655 1.0719 1.0789 1.1043 1.1586 1.1469 1.2004 2.2613 1.2508 1.3324 1.2847 1.8994 1.8354 1.3004 1.2549 1.8698 2.3542 1.3087 4.0088 2.5294 2.8435 2.0589 1.7073 1.5911 1.5481 2.4390 2.6421 2.4573 2.5559 2.2645 2.0520 2.2271 2.2107 1.9313 2.1948 2.7615 2.0619 2.0579 1.8164 1.3281 1.5401 1.5233 1.3190 1.3752 1.3186 1.3299 1.2930 1.2767 1.2071 1.2744 1.0543 1.1059 1.0622 1.1219 1.1437 1.2145 1.0855 1.1225 1.1116 1.3594 1.3996 1.3972 1.4223 1.5164 1.5498 1.6956 1.6421 1.6480 1.5993 1.4729 1.2256 1.2180 1.2158 1.0745 1.0754 1.0735 1.0728 1.0699 1.0695 1.0683 1.0761 1.0816 1.0765 1.0827 1.0563 1.0483 1.0618 1.0582 1.0795 1.0626 1.0827 1.0929 1.0861 1.0938 1.0733 1.0598 1.0588 1.0585 1.0591 1.0589 1.0590 1.0595 1.0599 1.0642 1.0619 1.0591 1.0585 1.0585 1.0581 1.0511 1.0369 1.0371 1.0445 1.0960 1.0968 1.0957 1.0980 1.0992 1.1009 1.0998 1.1028 1.1042 1.1031 1.1049 1.1050 1.1043 1.1047 1.1044 1.0991 1.0991 1.1005 1.1007 1.0993 1.0993
irintensity: 0.0002 0.0039 0.0062 0.0002 0.0010 0.0079 0.0016 0.0084 0.0060 0.0142 0.0004 0.0113 0.0190 0.0044 0.0074 0.0058 0.0077 0.0260 0.0018 0.0021 0.0574 0.0650 0.0157 0.0042 0.0177 0.0315 0.0237 0.1621 0.0656 0.0952 0.0010 0.0596 0.5512 0.0798 0.0641 4.9183 19.3383 0.4556 10.7008 6.1063 0.1002 0.2792 2.4495 0.0488 1.3711 2.5049 0.3525 0.1850 5.4850 6.4301 1.7466 0.5747 0.1973 2.3633 0.3677 0.2407 0.2825 2.1956 0.1353 0.0781 0.2270 1.3176 0.9541 1.2659 0.6848 2.3604 0.1876 0.5576 0.4280 0.4670 9.9022 6.4643 8.1183 1.7656 4.0693 1.6085 21.4158 1.0311 1.7063 1.8139 1.6276 2.8860 2.1890 0.2885 0.2935 0.0558 0.2821 0.0586 1.0228 0.3776 0.1727 0.2496 0.5999 0.0085 0.0151 0.3420 0.8859 0.5662 0.4074 3.0791 0.2806 0.6142 0.9529 0.6945 0.2553 0.3396 3.9432 21.7081 11.1466 11.1296 1.9280 0.5523 0.1448 0.6431 0.1538 0.0800 0.4395 0.0220 0.3854 0.8317 0.5055 7.0721 10.3162 7.3863 9.4409 1.1665 6.7755 4.1161 6.8776 18.4437 40.2072 11.8554 13.4186 0.2003 0.3371 0.0864 0.3684 0.1029 0.1386 1.0401 37.9144 43.7120 2.6325 90.8754 98.8463 129.3937 128.3542 35.6180 28.3821 72.4848 0.1230 0.3632 6.0193 0.2829 4.7349 4.5224 7.7939 1.1918 0.8973 4.6478 0.3240 6.7729 116.4186 16.6362 359.4258 46.9385 69.3782 88.1752 101.7923 93.7266 18.7108
temp: 298.150 k
press: 1.00000 atm
elementType: 6 6 6 6 6 6 6 6 6 6 6 6 6 6 6 6 6 6 6 1 1 1 1 1 1 1 1 1 1 1 1 1 1 1 1 1 1 1 1 1 1 1 1 1 1 1 1 1 1 1 1 1 1 1 1 1 1 1 1
symmnumber: 1
zpe: 1438819.9 jmol-1
zpe.correction: 0.548018 hartree
zpe.thermalcorrener: 0.574587 hartree
zpe.thermalcorrenthalpy: 0.575531 hartree
zpe.thermalcorrgfe: 0.486782 hartree
zpe.sumelectzpe: -746.406281 hartree
zpe.sumelectthermal: -746.379711 hartree
zpe.sumelectthermalent: -746.378767 hartree
zpe.sumelectthermalfe: -746.467517 hartree
dipole: 0.0626 -0.0776 -0.0988
dipole: 0.1403
quadrupole: -128.9496 -126.3102 -125.8986
quadrupole: 0.1393 -0.3846 -0.8195
quadrupole: -1.8968 0.7426 1.1542 0.1393 -0.3846 -0.8195
hfenergy: -746.9542986 hartree
pointgroup: C01 [X(C19H40)]
dipole: -0.0246528 0.0317902 -0.0378236 debye
polarizability: 265.4959132|1.7474596|189.6078891|-0.9616313|-0.2231765|174.7964873 unknown
InChI: InChI=1S/C19H40/c1-4-6-8-9-10-11-12-13-14-16-18-19(3)17-15-7-5-2/h19H,4-18H2,1-3H3
charge 0 multiplicity 1
59 atoms
C  -4.587983 1.6708 -0.032822
C  -3.154665 1.911798 -0.59144
C  -2.009484 1.178594 0.147343
C  -5.000377 0.176755 -0.138429
C  -0.627769 1.42698 -0.500231
C  0.525508 0.690845 0.218479
C  1.904069 0.911015 -0.444671
C  -6.512579 -0.090478 0.044336
C  3.053394 0.164863 0.269967
C  -4.745862 2.218795 1.407257
C  4.430507 0.37117 -0.400417
C  -6.885348 -1.578758 -0.141101
C  5.577617 -0.380956 0.311503
C  6.954093 -0.180768 -0.362333
C  -8.395623 -1.86228 0.028468
C  8.100672 -0.935143 0.348119
C  9.476891 -0.736101 -0.32763
C  -8.754001 -3.352059 -0.161212
C  10.616096 -1.494029 0.388085
H  -5.28033 2.247146 -0.686027
H  -2.94438 3.002194 -0.578202
H  -3.137353 1.604447 -1.658788
H  -1.97368 1.50247 1.20719
H  -2.208097 0.087943 0.158004
H  -4.43639 -0.416906 0.610552
H  -4.692763 -0.206585 -1.134833
H  -0.41755 2.517276 -0.512097
H  -0.660099 1.106399 -1.562976
H  0.569937 1.023628 1.276739
H  0.303342 -0.396781 0.244914
H  2.130532 1.997687 -0.468194
H  1.856669 0.581182 -1.503778
H  -6.837926 0.239762 1.051949
H  -7.082938 0.523194 -0.68491
H  2.821066 -0.920497 0.300264
H  3.106372 0.499972 1.327099
H  -4.142672 1.633467 2.126442
H  -5.797867 2.177961 1.743303
H  -4.415654 3.273094 1.467913
H  4.375871 0.038265 -1.458216
H  4.665466 1.455959 -0.428599
H  -6.314438 -2.193036 0.586793
H  -6.562215 -1.914386 -1.149221
H  5.634937 -0.045872 1.368434
H  5.340225 -1.465178 0.342685
H  7.192576 0.903242 -0.392662
H  6.896061 -0.515078 -1.419535
H  -8.965047 -1.247854 -0.69878
H  -8.718333 -1.528604 1.036059
H  7.863299 -2.019394 0.37924
H  8.161239 -0.600751 1.405132
H  9.41501 -1.069988 -1.383659
H  9.713704 0.347181 -0.35812
H  -8.22054 -3.984043 0.573909
H  -9.83819 -3.528694 -0.035193
H  -8.469474 -3.702255 -1.171656
H  10.419274 -2.582858 0.402587
H  10.716211 -1.15866 1.437812
H  11.588888 -1.333193 -0.112345
