program: Gaussian 09
title: 000009576
version: EM64L-G09RevD.01
frameworkgroup: C1[X(C11H13FN2)]
method: RPBEPBE
basis: SDD
operation: Freq
keyword: #p
keyword: freq=noraman
keyword: PBEPBE/SDD
title: #p freq=noraman PBEPBE/SDD
converged: YES YES NO NO
title: Mulliken charges:
elementType: F N N C C C C C C C C C C C H H H H H H H H H H H H H
charge: -0.219161 -0.087825 -0.405576 0.410967 0.116856 -0.500198 0.222861 -0.443454 -0.559385 -0.309526 -0.625502 -0.614095 0.338239 -0.370893 0.222618 0.184538 0.271176 0.305515 0.290344 0.230980 0.222506 0.251931 0.181623 0.184771 0.225354 0.226493 0.248842
chargesum: 0.00000
title: Mulliken charges with hydrogens summed into heavy atoms:
elementType: F N N C C C C C C C C C C C
charge: -0.219161 -0.087825 -0.100061 0.410967 0.116856 -0.093042 0.222861 -0.172277 -0.269042 -0.078545 0.030558 0.022523 0.338239 -0.122050
polarizability: 1.66328949e+02 7.70043452e+00 1.48198352e+02 -1.01459155e+01 2.34925137e+00 7.79377500e+01
1716.lowfreq: -10.2713 -8.0005 -1.7395 -0.0003 0.0006 0.0007 35.3848 64.2074 76.9135
frequency: 34.9694 64.1163 76.8932 146.8398 170.1490 208.6040 232.6203 244.0762 305.8154 312.6772 339.6317 359.0270 375.0390 426.5192 434.0127 446.0858 491.1675 502.6166 585.0750 589.3061 633.3621 699.4907 748.4853 769.6530 786.7740 798.6738 814.7205 821.6636 884.0814 918.2847 919.3214 973.1734 1016.3729 1034.3272 1047.7052 1089.6110 1096.3136 1129.2342 1130.7607 1155.5973 1173.0338 1226.1455 1236.0508 1259.5825 1262.1839 1292.3358 1316.3453 1364.8272 1392.3504 1415.5901 1428.0701 1439.3931 1457.2406 1457.9878 1460.4937 1473.2521 1474.7082 1482.8087 1484.7289 1565.3886 1590.0668 1637.6387 2819.3944 2842.6871 2858.8605 2980.3085 3016.9385 3028.7661 3076.4342 3089.6536 3141.9003 3176.6715 3183.5742 3219.7072 3615.3044
redmass: 3.3381 2.9598 4.0612 6.2747 3.2926 2.0543 1.0552 1.6193 3.6685 3.6455 2.1892 4.2146 5.0982 2.9287 6.8020 2.8794 3.6454 1.2894 3.0012 3.8670 3.7882 5.3025 4.1584 3.8851 1.8007 1.9559 3.1314 2.9909 1.4744 4.2304 1.3443 1.8080 2.3166 1.5373 2.3035 1.2560 1.5006 1.2612 1.3902 2.8143 1.9272 1.6532 1.8713 2.7066 1.8804 2.7292 2.0095 1.4647 5.4174 1.1424 2.3138 1.1922 1.2207 1.5374 1.6442 1.0685 1.0714 2.8577 1.2164 6.3900 6.8071 7.4081 1.0706 1.0575 1.0575 1.0855 1.0716 1.0720 1.1010 1.1007 1.0897 1.0957 1.0936 1.0983 1.0810
irintensity: 0.0163 0.8181 1.4366 0.9527 2.0336 0.8213 0.4398 0.9425 4.6597 5.5194 5.8534 0.6352 4.1158 8.6921 3.6941 2.5347 9.6351 90.8228 14.3470 13.1456 5.6008 14.4468 1.4106 10.8508 58.6853 6.5224 12.6666 34.4404 30.1428 39.1755 1.3901 9.2788 44.4445 16.1937 19.0541 7.6726 37.0301 0.9326 1.5248 46.5652 3.9554 2.5119 22.0315 3.5197 6.9362 15.2782 9.8889 13.3207 38.8935 4.4220 29.2614 3.8807 5.3465 29.4527 5.8684 7.0428 20.8566 55.1846 14.5960 7.9968 23.0501 13.5639 69.4080 72.3516 265.0347 29.1938 39.4667 33.1368 31.2775 33.3783 10.1217 5.1043 3.4971 0.7866 63.1723
temp: 298.150 k
press: 1.00000 atm
elementType: 9 7 7 6 6 6 6 6 6 6 6 6 6 6 1 1 1 1 1 1 1 1 1 1 1 1 1
symmnumber: 1
zpe: 572731.7 jmol-1
zpe.correction: 0.218142 hartree
zpe.thermalcorrener: 0.231070 hartree
zpe.thermalcorrenthalpy: 0.232014 hartree
zpe.thermalcorrgfe: 0.178484 hartree
zpe.sumelectzpe: -635.276207 hartree
zpe.sumelectthermal: -635.263279 hartree
zpe.sumelectthermalent: -635.262335 hartree
zpe.sumelectthermalfe: -635.315865 hartree
dipole: 1.4651 4.5920 0.3129
dipole: 4.8302
quadrupole: -74.4420 -75.5617 -84.7101
quadrupole: -9.9028 -2.5511 1.1366
quadrupole: 3.7959 2.6763 -6.4722 -9.9028 -2.5511 1.1366
hfenergy: -635.4943489 hartree
pointgroup: C01 [X(C11H13F1N2)]
dipole: 0.7293924 1.7106229 -0.3911604 debye
polarizability: 164.8613397|1.6211088|144.0533669|-19.0321766|-14.0868188|83.5503447 unknown
InChI: InChI=1S/C11H13FN2/c1-14(2)7-8-6-13-11-4-3-9(12)5-10(8)11/h3-6,13H,7H2,1-2H3
charge 0 multiplicity 1
27 atoms
F  -2.538397 -2.446184 0.845603
N  2.658955 -0.917755 0.155113
N  -0.46888 2.528652 -0.504789
C  1.022866 0.797107 -0.641452
C  -0.260895 0.271496 -0.209891
C  2.272296 0.00919 -0.941774
C  -1.179862 1.379619 -0.133206
C  0.853318 2.171987 -0.805543
C  -0.710539 -1.033857 0.126188
C  -2.528703 1.218619 0.254293
C  2.977759 -0.218506 1.415355
C  3.735093 -1.837711 -0.261196
C  -2.050618 -1.160694 0.502818
C  -2.967832 -0.081295 0.575199
H  2.109338 -0.617737 -1.842264
H  3.101852 0.722089 -1.196039
H  1.579105 2.920044 -1.120497
H  -0.850286 3.470469 -0.549099
H  -0.029562 -1.88818 0.114165
H  -3.220554 2.065784 0.308568
H  3.166046 -0.960875 2.211196
H  2.121289 0.405966 1.720274
H  3.879102 0.442684 1.334105
H  4.699168 -1.317603 -0.498286
H  3.421086 -2.399379 -1.159694
H  3.933172 -2.565919 0.5454
H  -3.999315 -0.275111 0.882951
