program: Gaussian 09
title: 000093061
version: EM64L-G09RevD.01
frameworkgroup: C1[X(C11H21N3O4)]
method: RPBEPBE
basis: SDD
operation: Freq
keyword: #p
keyword: freq=noraman
keyword: PBEPBE/SDD
title: #p freq=noraman PBEPBE/SDD
converged: YES YES NO NO
title: Mulliken charges:
elementType: O O O O N N N C C C C C C C C C C C H H H H H H H H H H H H H H H H H H H H H
charge: -0.262415 -0.230210 -0.278025 -0.304947 -0.376624 -0.570672 -0.350746 -0.393258 -0.374212 -0.173177 -0.354047 -0.394945 0.185735 0.229732 -0.524453 -0.500557 0.291996 -0.762844 0.225400 0.235889 0.214896 0.200573 0.295192 0.181310 0.217226 0.383572 0.204419 0.181350 0.259813 0.249871 0.271644 0.258907 0.314267 0.234799 0.245025 0.241284 0.214284 0.259007 0.254938
chargesum: 0.00000
title: Mulliken charges with hydrogens summed into heavy atoms:
elementType: O O O O N N N C C C C C C C C C C C
charge: -0.262415 -0.230210 -0.278025 -0.304947 0.006948 -0.040121 -0.036479 0.068032 0.041258 0.122015 0.044489 -0.009176 0.185735 0.229732 -0.014770 0.220552 0.291996 -0.034616
polarizability: 1.64272858e+02 6.09508649e+00 1.52592360e+02 4.62058943e+00 -8.55359608e+00 1.37133173e+02
1716.lowfreq: -8.8110 -0.0003 0.0004 0.0005 6.6991 8.8658 13.5182 19.0352 36.2269
frequency: 12.8850 18.7813 36.1412 51.3755 54.0400 57.8728 66.5493 68.2807 87.9946 97.5062 100.6507 109.6463 139.0224 139.2494 168.1355 191.8282 216.7072 221.0683 246.5118 260.4624 297.5485 328.0494 340.2186 352.9032 415.8504 427.8037 470.7585 529.9171 541.6286 581.0720 600.0739 604.5371 617.2304 655.0681 731.5571 740.9305 748.6930 760.9294 786.8145 824.7547 840.7765 888.4973 916.1516 940.2246 959.0499 972.1933 987.5754 1002.0546 1042.5086 1043.7453 1066.7148 1083.9019 1085.4228 1106.6012 1112.1567 1117.9181 1136.6328 1150.1707 1171.7738 1197.5590 1225.1628 1244.4395 1252.6222 1271.7598 1275.9853 1285.2815 1296.8447 1299.2730 1330.5979 1339.2713 1340.0723 1369.6247 1389.1618 1390.0711 1421.8717 1434.7517 1449.2398 1452.6148 1459.7686 1463.4431 1464.2737 1466.1823 1478.7869 1490.7709 1493.8925 1516.9718 1594.7130 1623.6629 1638.9759 1645.6786 2866.8778 2956.6325 2964.6024 2997.0299 2998.1857 3002.5232 3005.6749 3009.7638 3025.4932 3030.8621 3040.4719 3063.6143 3096.7242 3104.3548 3108.0219 3115.4019 3151.6178 3397.9615 3447.4806 3566.1433 3574.3026
redmass: 5.1376 4.6350 4.4010 2.6298 2.6499 4.8398 1.4245 2.9650 3.3187 1.1884 2.9013 3.6318 3.6957 2.0332 3.6733 3.1243 6.2315 3.7340 1.3204 3.5873 3.6073 4.2623 2.8901 3.3856 3.4973 3.9688 3.0357 3.0661 1.6044 3.8132 3.7561 2.7073 1.2946 3.9092 1.8383 1.2140 1.6763 6.0692 1.4108 3.0125 3.1856 2.6611 1.8487 5.8486 2.1202 1.8914 2.2367 2.3602 2.5613 2.0566 2.3373 2.6009 2.7956 2.5543 1.2931 1.9313 4.5435 1.4504 1.9023 1.3621 1.4368 1.4494 1.2711 1.9380 1.6169 1.0723 1.3050 1.1687 1.4197 1.3395 1.4630 1.5372 1.4393 1.2393 1.1873 1.1479 1.0464 1.0503 1.0872 1.0931 1.0592 1.0775 1.0943 1.9149 1.0962 1.8614 5.8826 6.3621 1.0939 8.8479 1.0715 1.0635 1.0616 1.0609 1.0368 1.0831 1.0295 1.0975 1.0621 1.0829 1.1017 1.1037 1.0986 1.1003 1.1046 1.1022 1.1049 1.0809 1.0448 1.0787 1.0972
irintensity: 0.4151 0.5251 1.7614 2.1053 2.3270 7.1018 2.5668 3.9381 6.9539 1.8716 10.5802 6.8936 7.9317 3.8266 3.8392 9.0304 4.7699 4.6986 52.1908 4.0364 17.5116 12.1769 1.2715 3.1007 2.2596 23.7202 31.7559 11.2522 107.0050 16.5181 10.9145 2.2457 205.5624 17.2437 17.9790 94.0575 69.2129 7.7190 7.2643 4.2110 2.1065 0.7382 1.9793 15.8775 0.1800 5.8780 4.1951 4.0164 7.9364 13.7576 3.2938 12.2068 4.3766 16.7561 1.1941 20.9376 261.3698 10.9116 9.5550 9.4377 21.2421 6.3044 16.0181 20.2144 46.0010 3.7345 8.4810 12.1846 23.4686 2.5629 32.1208 5.4912 28.2545 37.5205 17.3242 31.6117 12.6799 14.0038 7.1394 35.2230 20.3303 9.3783 8.5277 102.3301 3.5291 279.1261 57.8835 379.4560 39.1477 95.1931 102.8233 14.3584 32.4758 19.5798 11.5735 43.8182 34.1759 0.3637 17.9943 14.0831 47.5659 67.1398 11.7442 14.4538 25.4004 6.0451 14.7879 119.7891 2.2203 25.3990 0.1349
temp: 298.150 k
press: 1.00000 atm
elementType: 8 8 8 8 7 7 7 6 6 6 6 6 6 6 6 6 6 6 1 1 1 1 1 1 1 1 1 1 1 1 1 1 1 1 1 1 1 1 1
symmnumber: 1
zpe: 852053.3 jmol-1
zpe.correction: 0.324530 hartree
zpe.thermalcorrener: 0.346581 hartree
zpe.thermalcorrenthalpy: 0.347525 hartree
zpe.thermalcorrgfe: 0.269149 hartree
zpe.sumelectzpe: -895.507275 hartree
zpe.sumelectthermal: -895.485224 hartree
zpe.sumelectthermalent: -895.484280 hartree
zpe.sumelectthermalfe: -895.562655 hartree
dipole: 0.0414 2.5194 -0.4846
dipole: 2.5659
quadrupole: -73.8128 -104.8658 -125.8934
quadrupole: 1.5473 2.7452 0.2446
quadrupole: 27.7112 -3.3418 -24.3694 1.5473 2.7452 0.2446
hfenergy: -895.8318047 hartree
pointgroup: C01 [X(C11H21N3O4)]
dipole: -0.0758189 0.9957944 -0.1474455 debye
polarizability: 163.0325808|6.8359829|154.4946268|5.724046|-7.3228575|136.4711843 unknown
InChI: InChI=1S/C11H21N3O4/c1-8(15)13-7-10(16)14-9(11(17)18-2)5-3-4-6-12/h9,13-14H,3-7,12H2,1-2H3
charge 0 multiplicity 1
39 atoms
O  -3.153429 -2.110612 -0.077094
O  -1.589772 -1.916469 -1.793446
O  1.358758 -2.216877 2.085563
O  2.073993 0.119263 -1.756155
N  0.446567 -1.481673 0.062765
N  -1.807536 4.889255 0.624054
N  3.362437 -0.338231 0.113833
C  -1.334403 -0.105016 1.193296
C  -1.329749 1.073537 0.196279
C  -0.931997 -1.476478 0.56125
C  -1.578517 2.429135 0.893389
C  -1.606614 3.612863 -0.094482
C  -1.877635 -1.856399 -0.577414
C  1.49507 -1.838119 0.879352
C  2.883617 -1.730613 0.205879
C  -4.180286 -2.467116 -1.087771
C  2.924084 0.507615 -0.888128
C  3.509476 1.912938 -0.895266
H  -2.33757 -0.216798 1.646384
H  -0.619897 0.086547 2.016398
H  -0.358479 1.10948 -0.337253
H  -2.104526 0.910637 -0.581526
H  -1.004302 -2.241987 1.355998
H  -2.542306 2.389924 1.445524
H  -0.791267 2.623706 1.647433
H  0.651228 -1.138742 -0.88884
H  -0.6324 3.665134 -0.619226
H  -2.378415 3.405733 -0.877574
H  2.841078 -2.145638 -0.817042
H  3.593004 -2.313892 0.81283
H  -1.695085 5.724603 0.040838
H  -2.67923 4.920912 1.163937
H  3.979633 0.015501 0.845597
H  -5.102153 -2.615499 -0.508751
H  -3.887836 -3.389994 -1.615837
H  -4.294727 -1.651321 -1.821171
H  4.263625 2.079863 -0.107428
H  3.972385 2.102586 -1.878657
H  2.694774 2.647542 -0.771037
