program: Gaussian 09
title: 000092991
version: EM64L-G09RevD.01
frameworkgroup: C1[X(C7H12O)]
method: RPBEPBE
basis: SDD
operation: Freq
keyword: #pfreq=noraman
keyword: PBEPBE/SDD
title: #p freq=noraman PBEPBE/SDD
converged: YES YES NO NO
title: Mulliken charges:
elementType: O C C C C C C C H H H H H H H H H H H H
charge: -0.193926 -0.100631 -0.475367 -0.429218 -0.499208 0.110974 -0.402575 -0.703324 0.235690 0.205401 0.233812 0.224182 0.213057 0.238314 0.252813 0.202413 0.236429 0.221110 0.209197 0.220857
chargesum: 0.00000
title: Mulliken charges with hydrogens summed into heavy atoms:
elementType: O C C C C C C C
charge: -0.193926 0.135059 -0.036154 0.008021 -0.008081 0.110974 0.036268 -0.052160
polarizability: 8.42731072e+01 8.98219907e-01 7.70733477e+01 -1.15387029e+00 1.44402876e-01 5.99639751e+01
1716.lowfreq: -21.0976 -11.6373 -0.0011 -0.0007 -0.0003 8.8984 66.8315 93.4313 164.2880
frequency: 66.3456 93.3650 164.2667 189.3857 240.4145 308.0613 359.6716 474.6595 526.9491 544.2341 604.4880 714.6895 767.5594 825.9556 875.9897 902.9731 919.3309 955.5005 985.0524 1019.3405 1034.7093 1075.7208 1139.0877 1153.0076 1155.2327 1178.6698 1202.4542 1239.6989 1260.7169 1267.9057 1293.8303 1300.1603 1317.1205 1334.6159 1390.9825 1427.1842 1469.0849 1471.7961 1477.5543 1480.7833 1485.3882 1653.3111 2931.5517 2974.1653 2980.2738 2985.7359 2986.9526 3001.6763 3036.1163 3066.4519 3068.2561 3071.2787 3074.5975 3080.1377
redmass: 2.6291 2.2272 3.0059 1.6006 1.2191 3.8789 2.0895 2.8417 2.9374 3.2932 2.6438 2.6192 1.2037 1.9647 1.5388 2.1741 2.4785 1.4672 1.5090 1.4147 1.9046 2.4897 1.9207 2.3488 1.9028 1.7085 1.4751 1.4532 1.2389 1.3820 1.2557 1.3154 1.5625 1.5301 1.2145 1.0802 1.0704 1.0754 1.0593 1.0832 1.0618 12.3512 1.0801 1.0357 1.0621 1.0649 1.0660 1.0637 1.0994 1.0961 1.0974 1.1004 1.0993 1.1028
irintensity: 2.2457 1.5059 3.8647 0.4933 0.0473 2.4381 0.4205 4.9881 1.0593 3.7566 2.1642 1.2160 8.1230 16.3396 0.8022 5.4975 19.5627 3.0059 0.8665 1.4968 7.2119 7.6669 7.5231 60.0642 12.1571 0.7142 2.4143 12.8007 2.1746 5.0751 1.5321 0.6612 3.6734 6.0195 12.6898 20.3678 5.5790 10.5461 14.3897 1.1425 11.8836 164.5219 8.9858 32.1139 21.1794 23.4980 24.8668 36.8591 4.1575 16.1230 25.8388 51.9819 57.9345 49.9838
temp: 298.150 k
press: 1.00000 atm
elementType: 8 6 6 6 6 6 6 6 1 1 1 1 1 1 1 1 1 1 1 1
symmnumber: 1
zpe: 458196.3 jmol-1
zpe.correction: 0.174518 hartree
zpe.thermalcorrener: 0.182985 hartree
zpe.thermalcorrenthalpy: 0.183929 hartree
zpe.thermalcorrgfe: 0.141219 hartree
zpe.sumelectzpe: -348.526351 hartree
zpe.sumelectthermal: -348.517884 hartree
zpe.sumelectthermalent: -348.516940 hartree
zpe.sumelectthermalfe: -348.559650 hartree
dipole: 0.0904 -3.1966 0.0583
dipole: 3.1984
quadrupole: -47.3617 -58.0908 -47.6563
quadrupole: 3.0926 -0.3249 0.3023
quadrupole: 3.6745 -7.0545 3.3800 3.0926 -0.3249 0.3023
hfenergy: -348.7008689 hartree
pointgroup: C01 [X(C7H12O1)]
dipole: -0.0883017 1.2550926 0.0198977 debye
dipolederiv: -0.5339035 0.0325624 -0.0217787 0.055988 -1.0273258 -0.030931 -0.0310409 -0.0090631 -0.3234574 -0.4235225 0.187829 -0.0751976 0.1528831 -0.1051307 0.042903 -0.0928707 0.0938209 0.1471233 -0.0247378 -0.0083402 0.0283765 -0.0509503 0.0487497 -0.0385351 0.0100769 0.0216821 0.1418155 0.0213075 -0.0077748 0.0191891 0.007056 0.0774048 0.0376875 -0.0212 -0.0217939 0.1615245 -0.3716993 -0.2368152 -0.1259335 -0.1387327 -0.1392882 -0.037375 -0.1443554 -0.0865383 0.0841002 0.9810084 -0.0130004 0.1788785 -0.0741695 1.0719907 0.0405389 0.2422674 0.0022975 0.1198396 0.1661784 -0.007899 -0.0033767 0.0718605 0.0213898 0.0252059 -0.0395569 0.0078994 0.14624 -0.0607139 0.0505727 -0.0137726 0.0174477 0.0620784 0.0209164 0.0174851 0.0250183 0.0817733 0.0783805 0.009066 -0.0095287 0.0041847 0.0424552 -0.0038174 0.0048518 -0.0233171 -0.1244601 0.0436274 -0.006302 0.0440463 -0.0131586 0.0590646 0.0102898 0.0667429 -0.0493427 -0.1619421 -0.0130033 0.1136273 -0.0456994 0.1036699 -0.0727951 0.0538256 -0.0569703 0.0808062 0.0408763 -0.0182034 -0.103013 -0.0461631 -0.1034061 -0.0827725 -0.0672035 -0.0718888 -0.1028205 0.0322878 0.0468412 0.0126398 0.0208341 0.0185511 0.0478719 0.0297358 0.0693738 0.0816713 -0.1600498 0.1032605 -0.0029797 -0.007209 -0.0230951 0.0477587 0.0226376 -0.0531629 0.048953 -0.0843829 -0.0457306 0.0627296 0.064612 0.0639636 0.0226635 -0.0315381 0.1046789 -0.0171338 0.0666702 0.004799 0.0040247 -0.0599209 0.0102022 0.0792337 -0.0197062 -0.0128568 0.0162769 -0.1756804 0.0388007 -0.0094452 -0.0007256 -0.0522879 -0.1222636 -0.035377 -0.0059312 -0.0515196 0.073418 0.0932852 -0.0290465 -0.0220056 0.0252461 -0.1608748 -0.0584602 -0.0152632 -0.0687558 0.0611885 0.0756382 0.0142386 -0.0005824 0.0184648 0.0776514 -0.0085288 -0.0687717 0.0043127 -0.1791951 -0.1616126 -0.0626741 0.0759572 -0.0937175 0.0521382 0.0477319 0.098392 0.0475466 0.0523106 unknown
polarizability: 84.1843877|1.1995808|77.16074|1.1641084|-0.1365125|59.9653023 unknown
InChI: InChI=1S/C7H12O/c1-2-6-4-3-5-7(6)8/h6H,2-5H2,1H3
charge 0 multiplicity 1
20 atoms
O  0.826911 -2.067386 -0.080413
C  -0.444967 0.059462 -0.310762
C  -0.008024 1.473554 0.153456
C  1.520489 1.52366 -0.138735
C  2.014412 0.097888 0.209423
C  0.806399 -0.812664 -0.065661
C  -1.724981 -0.522925 0.32806
C  -3.004754 0.235912 -0.08201
H  -0.586561 0.07694 -1.41611
H  -0.189376 1.576086 1.242309
H  -0.559972 2.283238 -0.35336
H  2.035745 2.309866 0.438929
H  1.691986 1.732607 -1.211926
H  2.259267 0.012419 1.288022
H  2.904094 -0.242445 -0.34782
H  -1.61531 -0.503993 1.431111
H  -1.803633 -1.588447 0.039486
H  -2.964099 1.297209 0.225791
H  -3.14747 0.208348 -1.179102
H  -3.899457 -0.21453 0.385115
