program: Gaussian 09
title: 000093036
version: EM64L-G09RevD.01
frameworkgroup: C1[X(C9H12BrN2O8P)]
method: RPBEPBE
basis: SDD
operation: Freq
keyword: #p
keyword: freq=noraman
keyword: PBEPBE/SDD
title: #p freq=noraman PBEPBE/SDD
converged: YES YES NO NO
title: Mulliken charges:
elementType: Br P O O O O O O O O N N C C C C C C C C C H H H H H H H H H H H H
charge: 0.039452 1.408871 -0.284426 -0.436501 -0.509342 -0.260966 -0.734391 -0.666564 -0.569589 -0.220228 -0.190211 -0.408055 -0.144951 -0.016799 -0.547972 0.036016 -0.303647 0.216443 -0.050085 -0.304518 0.223144 0.227188 0.294323 0.237184 0.291672 0.285341 0.239381 0.234317 0.348002 0.389501 0.366987 0.412259 0.398165
chargesum: 0.00000
title: Mulliken charges with hydrogens summed into heavy atoms:
elementType: Br P O O O O O O O O N N C C C C C C C C C
charge: 0.039452 1.408871 -0.284426 -0.088499 -0.509342 -0.260966 -0.322132 -0.268399 -0.569589 -0.220228 -0.190211 -0.041067 0.082237 0.277524 -0.019116 0.321357 0.170050 0.216443 0.339416 -0.304518 0.223144
polarizability: 2.03432459e+02 7.52489940e+00 2.26361698e+02 -3.51199043e+00 4.03884229e-02 1.05537708e+02
1716.lowfreq: -6.4823 -4.3056 -0.0010 0.0012 0.0014 5.9255 14.7666 32.0526 44.1118
frequency: 14.5988 32.0142 44.0736 48.9148 62.1827 81.0686 93.5192 99.7195 115.7145 144.0126 171.9310 176.7341 199.2981 213.3744 231.3887 241.5715 262.9608 274.5322 282.6510 313.4537 324.5051 343.1111 344.5044 351.6371 369.7575 391.2588 397.9091 415.1119 431.3586 456.4773 504.2966 535.1941 583.3223 608.1590 632.4062 658.4865 691.3085 712.2604 719.1955 724.4514 730.0477 749.8085 773.4065 811.4590 832.4082 871.3635 929.6561 949.9116 960.0117 983.1628 987.9000 997.8003 1003.3216 1005.9752 1034.9314 1058.7722 1065.8819 1093.6957 1097.9691 1106.7929 1156.7835 1174.0516 1191.3646 1228.0687 1233.7946 1254.2168 1267.3358 1289.3036 1308.6447 1321.7383 1330.5646 1358.3998 1366.3285 1367.7382 1383.9184 1405.3719 1445.2975 1459.4867 1593.0981 1636.7885 1652.9176 2983.7582 3005.6746 3024.0682 3048.9908 3061.1736 3082.2526 3104.3191 3118.2461 3521.9685 3544.1738 3566.5539 3590.7466
redmass: 10.0846 7.9497 7.2432 14.5974 9.7588 6.5029 7.3255 4.9066 9.5933 7.1001 8.1340 5.0948 7.9000 5.1665 6.9824 3.6806 2.8026 8.1580 5.6860 1.8096 2.0937 1.5377 5.6530 4.0303 5.9712 5.8944 2.2307 4.4446 3.0471 3.0172 3.6464 4.1447 7.0793 5.4583 10.6347 6.0584 1.8877 11.6752 6.8648 5.8769 9.3171 8.0207 2.4000 3.7887 3.8719 3.0941 3.0481 3.9018 2.7363 1.5837 2.2382 2.1046 1.3913 1.3971 3.8420 2.2678 3.4050 2.9663 4.6719 3.7636 1.7341 3.7141 1.3443 1.1493 1.2775 1.7171 1.6244 1.4756 1.7361 1.3457 1.6343 1.5369 1.4384 1.5257 1.5622 2.4773 1.0826 1.0954 5.8812 12.7669 5.8810 1.0837 1.0577 1.0661 1.0858 1.0906 1.1044 1.1017 1.0965 1.0770 1.0672 1.0663 1.0662
irintensity: 1.0756 3.2225 0.7331 0.2722 0.5528 1.4929 0.6589 2.3460 1.4513 2.5206 5.0743 3.1349 2.1311 16.3108 2.4953 10.0817 32.1731 2.9579 0.6045 115.0473 82.6403 79.7650 9.9303 46.3450 16.2858 20.1863 90.6739 8.7243 43.4512 20.0492 18.2083 16.5419 18.5010 9.0581 16.6041 30.6250 14.0196 0.3108 70.4090 102.1547 305.8442 4.9413 127.9357 13.6152 17.3678 32.8450 70.1664 119.0186 21.0387 12.8557 20.3430 178.7272 61.0735 74.3079 84.8783 21.8675 67.7525 103.4305 182.3687 17.9168 31.8059 40.9834 26.4549 11.8232 3.4593 71.0214 155.0586 7.3028 39.3428 12.8785 75.6233 5.6938 2.8750 0.1131 4.5584 79.7161 7.3677 18.4269 53.6569 316.7245 719.7157 32.3220 31.9108 16.1851 8.3295 0.5616 26.2262 9.7703 158.0787 72.2097 230.7655 10.7225 76.9510
temp: 298.150 k
press: 1.00000 atm
elementType: 35 15 8 8 8 8 8 8 8 8 7 7 6 6 6 6 6 6 6 6 6 1 1 1 1 1 1 1 1 1 1 1 1
symmnumber: 1
zpe: 594662.7 jmol-1
zpe.correction: 0.226495 hartree
zpe.thermalcorrener: 0.248235 hartree
zpe.thermalcorrenthalpy: 0.249179 hartree
zpe.thermalcorrgfe: 0.173406 hartree
zpe.sumelectzpe: -1414.529744 hartree
zpe.sumelectthermal: -1414.508004 hartree
zpe.sumelectthermalent: -1414.507060 hartree
zpe.sumelectthermalfe: -1414.582833 hartree
dipole: 4.4109 3.0266 5.6608
dipole: 7.7885
quadrupole: -154.5448 -131.7540 -142.9863
quadrupole: 0.2656 19.3530 2.0559
quadrupole: -11.4497 11.3410 0.1087 0.2656 19.3530 2.0559
hfenergy: -1414.756239 hartree
pointgroup: C01 [X(C9H12Br1N2O8P1)]
dipole: -1.2323807 1.8334624 -2.1235084 debye
polarizability: 201.1028707|2.9261177|228.1203426|-6.4753295|5.4417769|106.1086521 unknown
InChI: InChI=1S/C9H12BrN2O8P/c10-4-2-12(9(15)11-8(4)14)7-1-5(13)6(20-7)3-19-21(16,17)18/h2,5-7,11,13,16-17H,1,3H2
charge 0 multiplicity 1
33 atoms
Br 0.926275 -3.777908 -0.377702
P  -3.559232 -1.431052 0.218383
O  -0.619112 1.126423 0.851362
O  -0.828212 4.214263 0.229763
O  -3.41136 0.256387 0.410344
O  3.435654 1.727569 0.134104
O  -1.920795 -1.821642 -0.08735
O  -4.18187 -1.685142 -1.381162
O  -4.351698 -2.144006 1.38144
O  4.018029 -2.877785 -0.503774
N  1.528296 0.353182 0.144771
N  3.668321 -0.592786 -0.152296
C  -0.959261 3.026592 -0.624861
C  -1.686324 1.971408 0.246735
C  0.404189 2.369384 -0.928726
C  0.685927 1.567823 0.362305
C  -2.663235 1.104511 -0.551549
C  2.92429 0.57608 0.052319
C  0.964087 -0.910897 0.021826
C  1.740447 -2.02207 -0.205185
C  3.201949 -1.940302 -0.307102
H  -1.519179 3.271008 -1.550363
H  -2.215915 2.475114 1.073034
H  0.314227 1.677577 -1.786678
H  1.204117 3.095778 -1.142901
H  1.200492 2.184692 1.119371
H  -2.142181 0.481994 -1.301888
H  -3.414404 1.744089 -1.049853
H  -0.278897 4.897486 -0.231634
H  -0.125001 -0.958917 0.134477
H  4.684103 -0.466135 -0.214477
H  -1.687821 -2.769354 -0.268343
H  -5.157304 -1.860864 -1.411492
