program: Gaussian 09
title: 000092976
version: EM64L-G09RevD.01
frameworkgroup: C1[X(C15H12O)]
method: RPBEPBE
basis: SDD
operation: Freq
keyword: #pfreq=noraman
keyword: PBEPBE/SDD
title: #p freq=noraman PBEPBE/SDD
converged: YES YES NO NO
title: Mulliken charges:
elementType: O C C C C C C C C C C C C C C C H H H H H H H H H H H H
charge: -0.452038 -0.138439 0.356075 0.378838 -0.417666 -0.370254 -0.355858 -0.387339 0.258939 -0.225932 -0.227814 -0.229627 -0.219256 -0.240633 -0.244457 -0.536215 0.254013 0.248273 0.264604 0.285107 0.351903 0.227381 0.225177 0.228585 0.225344 0.229923 0.227106 0.284261
chargesum: 0.00000
title: Mulliken charges with hydrogens summed into heavy atoms:
elementType: O C C C C C C C C C C C C C C C
charge: -0.100135 -0.138439 0.356075 0.378838 -0.163653 -0.121981 -0.091254 -0.102232 0.258939 0.001450 -0.002637 -0.001043 0.006088 -0.010710 -0.017352 -0.251955
polarizability: 1.84372212e+02 -1.94115135e+00 1.50382788e+02 1.69972818e+01 -8.79080018e+00 1.28015676e+02
1716.lowfreq: -16.9320 -5.3901 -0.0007 -0.0007 -0.0005 7.3322 21.4349 35.6551 64.1687
frequency: 21.0870 35.4896 64.1560 97.5162 123.7739 189.3301 211.0496 230.4277 283.2620 302.8061 337.9883 377.1451 400.4874 402.1580 404.7375 436.2006 501.9535 538.2491 592.0747 614.7174 615.8988 630.3443 640.2847 661.2052 686.7142 704.0772 705.7439 765.4359 774.9710 856.7195 859.4494 873.4463 924.1307 931.9988 943.3420 982.1702 983.5687 990.2571 990.7408 997.3726 999.7751 1012.8721 1027.3775 1032.9188 1083.4463 1091.7002 1150.3406 1171.8314 1172.3077 1187.1126 1189.2857 1198.4457 1290.6774 1318.0605 1322.0003 1381.1677 1384.3264 1434.9010 1436.0206 1477.5719 1479.2315 1591.1738 1594.8569 1608.7843 1612.0402 2128.5724 3123.3017 3124.7862 3132.1815 3133.7129 3144.7706 3145.2998 3153.6695 3160.5734 3165.9433 3179.8787 3426.5888 3551.2423
redmass: 3.9661 3.8876 4.8564 4.4965 4.3270 3.9955 4.6696 4.7289 4.7730 1.6201 2.3274 5.7152 3.4264 3.1457 3.4214 6.4831 4.5777 3.6999 5.8275 6.3060 6.3950 2.0252 2.1418 1.2513 6.5164 1.7895 1.7711 1.8035 1.9444 1.2575 1.2480 3.4943 2.3437 1.5808 2.2779 1.3908 1.3926 5.7374 6.1436 1.3685 1.3145 4.3864 2.1788 2.2832 1.5709 1.6908 2.0144 1.0604 1.0544 1.2029 1.1811 2.9555 1.6514 1.3137 1.3507 8.8927 9.6295 2.2214 2.2194 2.2022 2.2539 6.2469 6.4340 6.0178 6.0570 6.0390 1.0847 1.0847 1.0887 1.0879 1.0941 1.0922 1.0961 1.0992 1.1014 1.0955 1.1589 1.0660
irintensity: 0.1828 0.0121 0.2082 0.9110 0.6934 2.2900 0.9976 0.1193 2.5895 77.9229 76.9566 6.9915 5.9391 8.8280 6.7205 1.1024 10.5690 7.1407 11.2699 0.0885 0.1339 13.9211 82.1186 53.5044 4.4799 45.7816 68.2834 67.2626 54.0587 0.3252 0.5213 36.6722 35.0334 9.1033 28.7624 0.2161 0.1716 0.1217 0.8094 3.5972 0.1268 28.8073 13.5788 4.0329 1.0514 3.8656 38.2349 0.4860 0.0406 17.7433 2.7272 20.9748 30.9207 0.3863 21.4204 0.6653 0.2246 20.3139 13.1069 16.8283 14.4756 0.7901 0.1132 4.7657 1.6969 1.3331 0.8359 0.2093 6.4715 5.1590 32.3943 14.5944 25.3528 26.8215 22.3199 6.7603 69.3562 10.9086
temp: 298.150 k
press: 1.00000 atm
elementType: 8 6 6 6 6 6 6 6 6 6 6 6 6 6 6 6 1 1 1 1 1 1 1 1 1 1 1 1
symmnumber: 1
zpe: 571224.2 jmol-1
zpe.correction: 0.217568 hartree
zpe.thermalcorrener: 0.231517 hartree
zpe.thermalcorrenthalpy: 0.232461 hartree
zpe.thermalcorrgfe: 0.175672 hartree
zpe.sumelectzpe: -652.837354 hartree
zpe.sumelectthermal: -652.823405 hartree
zpe.sumelectthermalent: -652.822461 hartree
zpe.sumelectthermalfe: -652.879249 hartree
dipole: -1.3837 -0.0101 -0.7487
dipole: 1.5733
quadrupole: -83.9220 -85.2797 -89.5158
quadrupole: -2.0842 1.0358 -1.7100
quadrupole: 2.3172 0.9595 -3.2766 -2.0842 1.0358 -1.7100
hfenergy: -653.0549216 hartree
pointgroup: C01 [X(C15H12O1)]
dipole: -0.5181339 0.0420177 -0.3360249 debye
polarizability: 181.1321832|-4.0573778|152.2342279|20.9428715|-6.9387467|129.4042654 unknown
InChI: InChI=1S/C15H12O/c1-2-15(16,13-9-5-3-6-10-13)14-11-7-4-8-12-14/h1,3-12,16H
charge 0 multiplicity 1
28 atoms
O  -0.027635 1.051518 2.018009
C  -0.01498 0.874991 0.535744
C  -1.3079 0.144891 0.111842
C  1.249285 0.038018 0.227108
C  -2.208399 0.667747 -0.845526
C  1.376413 -0.604927 -1.028165
C  -1.599082 -1.097168 0.733643
C  2.301702 -0.050084 1.167679
C  0.119046 2.20752 -0.10361
C  -3.386215 -0.041689 -1.179224
C  2.543925 -1.334869 -1.338457
C  -2.773674 -1.802227 0.402484
C  3.466935 -0.787461 0.857169
C  -3.672734 -1.276609 -0.55717
C  3.59422 -1.429585 -0.395571
C  0.246415 3.328704 -0.59812
H  -1.988849 1.626327 -1.327948
H  0.56046 -0.542617 -1.757328
H  -0.899734 -1.498267 1.475033
H  2.190579 0.447152 2.134553
H  -0.839321 1.57278 2.250904
H  -4.0766 0.371582 -1.923095
H  2.632275 -1.831289 -2.311361
H  -2.990053 -2.759927 0.888885
H  4.275443 -0.857217 1.593751
H  -4.58526 -1.825304 -0.816007
H  4.499699 -1.998638 -0.634991
H  0.382541 4.303747 -1.028832
