program: Gaussian 09
title: 000092886
version: EM64L-G09RevD.01
frameworkgroup: C1[X(C6H12O2)]
method: RPBEPBE
basis: SDD
operation: Freq
keyword: #pfreq=noraman
keyword: PBEPBE/SDD
title: #p freq=noraman PBEPBE/SDD
converged: YES YES NO NO
title: Mulliken charges:
elementType: O O C C C C C C H H H H H H H H H H H H
charge: -0.460427 -0.480419 -0.044633 -0.099863 -0.430250 -0.433046 -0.395178 -0.392681 0.195061 0.204299 0.224386 0.209234 0.189956 0.214321 0.198134 0.206007 0.196759 0.205126 0.351538 0.341675
chargesum: 0.00000
title: Mulliken charges with hydrogens summed into heavy atoms:
elementType: O O C C C C C C
charge: -0.108889 -0.138744 0.150428 0.104436 0.003370 -0.028769 0.008964 0.009204
polarizability: 7.62444833e+01 1.74377789e+00 7.23297199e+01 -7.29718993e-02 -4.85137885e-01 5.75473914e+01
1716.lowfreq: -26.2003 -0.0005 0.0004 0.0006 11.7180 18.9414 121.8408 177.2637 241.7873
frequency: 121.8290 177.2528 241.7811 279.8628 307.5965 339.7835 363.1402 425.8378 435.8513 488.5365 512.5872 549.6701 779.8423 835.3861 840.4839 876.0105 915.2000 940.0075 999.8856 1032.3736 1038.9298 1056.6950 1096.4328 1102.4758 1130.4166 1142.9041 1224.0239 1230.8359 1243.9599 1262.0875 1299.4588 1321.5297 1323.0993 1333.5023 1335.4331 1342.7687 1386.8493 1394.5736 1464.1014 1464.8354 1470.9292 1477.9261 2933.6775 2958.0028 2971.6964 2975.5922 2978.0090 2993.4411 3033.3465 3039.5005 3048.2483 3063.3108 3530.0000 3580.0494
redmass: 3.7157 2.2856 2.7069 1.2901 1.7142 3.2641 2.5977 3.3701 3.2839 1.1667 3.7086 2.0111 1.8459 1.8227 1.8849 2.1080 1.6720 2.3411 3.7707 2.4536 1.4823 2.0058 1.7614 1.6911 2.1781 1.2469 1.3614 1.2558 1.2574 1.2278 1.2398 1.2651 1.3208 1.3931 1.4038 1.5070 1.4896 1.7821 1.0896 1.0963 1.0829 1.0960 1.0815 1.0852 1.0623 1.0626 1.0625 1.0630 1.1001 1.0965 1.1018 1.1019 1.0649 1.0664
irintensity: 2.7620 0.7337 12.4997 129.3683 0.3465 6.4176 4.2962 8.8375 11.9342 154.1722 16.9474 7.7442 0.7294 12.8530 24.9968 0.7740 9.2152 14.9129 115.7347 54.8224 4.7180 8.5811 1.7038 15.0403 2.8075 28.3479 8.3270 13.5221 2.8563 17.9612 1.7028 2.1392 30.9417 6.4926 1.0179 3.0977 1.8476 13.1232 9.6543 5.8457 22.0714 3.9701 16.1314 54.7877 35.1233 34.1002 44.8114 31.2354 41.1826 49.2804 64.2536 62.7730 11.2226 4.2357
temp: 298.150 k
press: 1.00000 atm
elementType: 8 8 6 6 6 6 6 6 1 1 1 1 1 1 1 1 1 1 1 1
symmnumber: 1
zpe: 458837.0 jmol-1
zpe.correction: 0.174762 hartree
zpe.thermalcorrener: 0.182915 hartree
zpe.thermalcorrenthalpy: 0.183859 hartree
zpe.thermalcorrgfe: 0.142784 hartree
zpe.sumelectzpe: -385.612945 hartree
zpe.sumelectthermal: -385.604792 hartree
zpe.sumelectthermalent: -385.603848 hartree
zpe.sumelectthermalfe: -385.644923 hartree
dipole: -1.6008 2.7169 -0.4977
dipole: 3.1924
quadrupole: -49.6571 -49.7375 -49.3745
quadrupole: 4.9438 -1.2229 -3.1027
quadrupole: -0.0674 -0.1478 0.2152 4.9438 -1.2229 -3.1027
hfenergy: -385.7877068 hartree
pointgroup: C01 [X(C6H12O2)]
dipole: -0.6599497 -1.0455958 0.2207191 debye
dipolederiv: -0.7654594 -0.2845136 -0.0761465 -0.3042771 -0.4632041 0.0982158 -0.0919798 0.0993512 -0.5156152 -0.8801373 0.1956505 -0.0482178 0.2008143 -0.4483151 -0.1937009 0.0000199 -0.2097382 -0.4070786 0.5830131 0.1467832 0.089767 0.2018436 0.3010007 -0.0010349 0.0426896 -0.0205291 0.3879521 0.574049 -0.1897059 -0.0273122 -0.2515867 0.2853085 0.0979697 0.0170255 0.1012551 0.3124888 -0.0455202 -0.0323071 0.0015947 0.0378705 0.0398911 -0.0142247 0.0050094 0.0183257 0.1253571 -0.1374336 0.0598631 -0.002039 -0.052185 0.0348746 -0.0491512 0.0090852 -0.0193227 0.1047448 0.0670786 -0.005202 -0.0125464 0.0039248 0.0552345 0.0202808 0.0280735 0.0042559 0.152425 0.0754749 0.0087011 0.0123539 -0.0221065 0.0481876 0.0282412 -0.0365409 0.0129235 0.1530422 -0.011882 -0.0229438 -0.021073 -0.0276969 -0.0059509 -0.0653014 -0.0397159 -0.0443834 -0.2121754 -0.022467 0.0288 0.0129867 0.0149576 0.0085586 -0.0382702 0.0204372 -0.0383284 -0.2043124 0.0593091 -0.0125416 0.0002526 0.0024457 -0.149993 0.0771316 0.0071037 0.0998096 0.047528 0.0387218 -0.0034637 -0.013118 0.0045399 0.0848142 -0.0026744 0.0001218 -0.0651091 -0.1592818 0.029316 0.023675 -0.0080275 0.0018036 -0.2030968 0.0814959 -0.0165617 0.1177288 0.0386195 0.0390512 0.0006473 0.0181263 -0.0025654 0.0793045 0.0017829 -0.0023075 -0.0636343 -0.1536127 0.0711463 -0.0276327 0.0131576 -0.0374784 0.035195 -0.0292919 -0.0516436 0.005013 -0.1910014 -0.1415576 0.1125511 0.0410106 0.1172346 -0.0307705 -0.0225256 0.0709383 -0.0387508 0.0662724 0.0730217 0.0268318 -0.0199716 0.0358447 0.0345884 -0.0256771 0.0446189 0.008539 -0.1925525 -0.1551463 -0.1048054 -0.0378821 -0.1129492 -0.0310015 -0.0213175 -0.0653727 -0.0381572 0.0679967 0.2168222 0.1291603 0.0109576 0.1639321 0.2521486 -0.07729 0.0131283 -0.0831327 0.3247625 0.3325995 -0.0495475 0.0661272 0.0256337 0.0732255 0.135342 0.0458708 0.1538838 0.2544412 unknown
polarizability: 76.1400585|-1.8556847|72.4063832|0.0394258|-0.8041937|57.5751529 unknown
InChI: InChI=1S/C6H12O2/c7-5-3-1-2-4-6(5)8/h5-8H,1-4H2
charge 0 multiplicity 1
20 atoms
O  1.840202 1.430755 0.129496
O  1.886984 -1.35551 -0.176598
C  0.655775 0.687658 -0.313895
C  0.638218 -0.719583 0.306288
C  -0.591556 1.484024 0.093932
C  -0.625458 -1.4955 -0.108195
C  -1.88244 0.722883 -0.29404
C  -1.896695 -0.70818 0.301289
H  0.679141 0.556689 -1.420078
H  0.677597 -0.617252 1.41364
H  -0.555757 2.477485 -0.38865
H  -0.558911 1.653834 1.188205
H  -0.62743 -2.501827 0.357181
H  -0.607791 -1.642149 -1.206468
H  -1.956104 0.657697 -1.398983
H  -2.768991 1.287018 0.052058
H  -1.949095 -0.641855 1.407611
H  -2.799564 -1.254989 -0.030144
H  2.617548 0.827624 -0.008289
H  1.993529 -2.242823 0.24794
