program: Gaussian 09
title: 000093126
version: EM64L-G09RevD.01
frameworkgroup: C1[X(C25H22N2)]
method: RPBEPBE
basis: SDD
operation: Freq
keyword: #pfreq=noraman
keyword: PBEPBE/SDD
title: #p freq=noraman PBEPBE/SDD
converged: YES YES NO NO
title: Mulliken charges:
elementType: N N C C C C C C C C C C C C C C C C C C C C C C C C C H H H H H H H H H H H H H H H H H H H H H H
charge: -0.151783 -0.080742 0.391054 0.353968 0.032511 0.032556 -0.463911 -0.464511 0.403176 -0.412394 -0.412269 0.327058 0.326953 -0.373100 -0.373138 -0.377319 -0.379735 -0.377428 -0.379995 -0.646123 -0.646081 -0.248992 -0.233328 -0.248904 -0.233354 -0.241609 -0.241509 0.233801 0.234204 0.230918 0.230837 0.236415 0.236398 0.220277 0.274777 0.220686 0.274361 0.234831 0.236075 0.218153 0.218147 0.236009 0.234882 0.222584 0.224699 0.222619 0.224707 0.226786 0.226780
chargesum: 0.00000
title: Mulliken charges with hydrogens summed into heavy atoms:
elementType: N N C C C C C C C C C C C C C C C C C C C C C C C C C
charge: -0.151783 -0.080742 0.391054 0.353968 0.032511 0.032556 -0.230110 -0.230306 0.403176 -0.181476 -0.181432 0.327058 0.326953 -0.136685 -0.136740 -0.157043 -0.104958 -0.156742 -0.105634 0.042937 0.042957 -0.026408 -0.008629 -0.026285 -0.008647 -0.014823 -0.014728
polarizability: 4.96618578e+02 4.87598498e-02 3.77302098e+02 -2.23436073e-01 -1.78730488e+01 1.32021988e+02
1716.lowfreq: -5.3631 -4.9998 0.0004 0.0006 0.0010 0.1209 21.4427 28.1300 31.1135
frequency: 21.3526 28.0145 31.1029 32.9634 44.3450 67.2067 73.3187 81.4257 110.3473 112.3175 141.1713 164.9874 195.6682 208.3779 217.3946 219.3013 231.5610 259.1623 275.2787 293.1594 341.1528 376.1416 401.8899 403.6918 415.4792 419.1060 435.4575 459.7666 472.2788 477.6201 521.7527 557.7392 568.5250 614.8381 616.3910 621.4525 626.2123 641.8066 644.2294 649.6075 698.7051 699.6056 727.2789 734.7596 736.2267 783.3446 783.7276 804.9074 814.7149 817.9913 827.1682 852.4830 852.9409 886.7410 888.8746 932.2354 932.6755 941.7298 942.5315 950.5777 961.1062 980.9497 981.2839 989.0740 989.1575 992.1478 1001.1898 1002.4164 1014.3630 1026.0657 1042.5986 1056.0166 1078.6923 1081.0599 1083.1606 1108.4692 1110.0186 1125.9200 1136.1220 1166.5506 1170.0465 1170.8100 1187.4268 1189.6558 1209.5907 1247.3720 1250.4432 1260.9995 1297.9382 1307.6609 1311.2221 1324.2339 1357.4692 1360.5526 1362.1386 1375.6251 1381.9768 1397.4104 1406.2764 1427.8232 1440.0577 1443.3053 1444.0872 1459.2425 1464.4800 1475.1699 1486.0182 1489.3360 1494.6754 1507.7428 1527.5138 1532.8228 1558.2794 1583.1479 1587.3370 1591.0379 1612.3304 1612.9996 1633.9683 2939.8259 2947.5508 3006.0560 3008.6376 3096.7596 3106.5902 3121.5000 3121.5842 3126.6511 3128.7951 3130.5444 3130.6193 3143.4183 3143.6270 3156.5396 3157.2427 3158.7683 3160.4640 3162.2097 3166.4379 3169.6161 3169.8381
redmass: 3.7743 3.5869 3.2222 4.6925 4.9892 5.1552 5.0584 2.4585 4.2358 2.3641 2.3617 3.1763 5.3846 1.1518 4.2242 3.4314 2.4744 5.0765 5.4405 4.5621 4.6097 4.3984 2.9877 2.8328 5.1699 2.9649 3.5647 3.8018 3.7936 3.7162 2.6290 4.4309 4.1552 6.1048 6.3731 4.4543 6.7916 5.8687 3.6674 6.5076 1.6744 1.6437 5.4679 2.7607 3.2092 1.9397 2.0274 1.2770 6.1959 2.1909 4.2873 1.2670 1.2624 1.8648 1.4554 1.4684 1.4714 3.0870 1.3918 1.5756 3.9541 1.3821 1.4343 4.5320 5.9334 4.2992 1.3363 1.3477 3.8649 2.2354 2.0690 1.4932 1.5952 1.5385 2.0971 1.2368 1.3224 2.6067 1.4789 1.6805 1.0573 1.0573 1.1366 1.1245 1.1178 2.0524 1.8366 2.9112 3.0378 1.4542 1.4328 1.7566 2.6106 3.2421 3.8095 5.1564 7.1907 5.9311 3.2748 1.3860 2.4520 2.3788 2.3919 1.2482 1.0460 1.0462 2.5047 2.4139 1.1311 1.1073 6.9152 2.8652 7.1193 4.8465 6.2383 6.4064 6.1382 6.0782 6.1843 1.0369 1.0394 1.0991 1.1030 1.0961 1.0941 1.0844 1.0844 1.0886 1.0883 1.0881 1.0881 1.0937 1.0937 1.0938 1.0964 1.0931 1.0917 1.0932 1.0945 1.0981 1.0981
irintensity: 0.2843 0.0321 0.1382 1.2475 0.4987 0.0216 0.0585 0.0530 1.1094 7.0698 0.3173 1.0874 0.0225 0.0289 1.3614 0.8657 0.7428 0.8507 0.0337 0.3174 5.1245 0.0045 0.0018 0.0202 0.1595 2.8667 0.0645 0.0174 2.5941 4.0583 28.2165 18.6580 0.7769 0.8976 0.0081 3.3056 15.3964 4.4972 0.3753 13.7046 96.4969 5.5445 9.3502 13.5025 5.4089 107.7367 10.5856 4.6187 2.6274 63.1370 18.1641 0.7959 1.1550 19.7423 0.2983 5.0286 0.0780 25.5071 0.0222 4.9969 0.0266 1.6890 0.6405 0.4739 0.0085 0.6140 3.2639 1.2888 11.1184 17.4665 1.0940 25.1655 1.6549 8.3308 17.6274 0.1216 0.9551 1.1497 2.5174 10.4512 2.2481 0.4133 15.7935 9.3925 102.9707 24.4812 14.8388 31.8846 1.9852 0.8559 6.5377 3.0963 74.3321 5.5814 13.8785 116.8208 0.6219 36.8533 50.9222 25.0411 14.0551 5.5183 4.2184 25.9154 1.1385 22.5704 60.8351 9.0198 0.2366 66.5552 158.3425 372.8767 33.3440 271.3710 0.8853 143.1508 2.7509 0.4873 333.5799 102.7782 145.8053 0.1253 87.9523 3.9403 52.6004 4.0534 2.9412 4.8097 19.6537 13.3216 0.9027 8.3421 64.3475 15.7657 1.2020 42.5426 3.0265 31.8512 17.8971 18.9087 20.8696
temp: 298.150 k
press: 1.00000 atm
elementType: 7 7 6 6 6 6 6 6 6 6 6 6 6 6 6 6 6 6 6 6 6 6 6 6 6 6 6 1 1 1 1 1 1 1 1 1 1 1 1 1 1 1 1 1 1 1 1 1 1
symmnumber: 1
zpe: 1040767.1 jmol-1
zpe.correction: 0.396407 hartree
zpe.thermalcorrener: 0.419638 hartree
zpe.thermalcorrenthalpy: 0.420582 hartree
zpe.thermalcorrgfe: 0.341028 hartree
zpe.sumelectzpe: -1073.514661 hartree
zpe.sumelectthermal: -1073.491430 hartree
zpe.sumelectthermalent: -1073.490486 hartree
zpe.sumelectthermalfe: -1073.570040 hartree
dipole: 6.2765 0.0019 0.0039
dipole: 6.2765
quadrupole: -110.1536 -138.3789 -166.9969
quadrupole: -0.0170 -0.0295 -5.9923
quadrupole: 28.3562 0.1309 -28.4871 -0.0170 -0.0295 -5.9923
hfenergy: -1073.911068 hartree
pointgroup: C01 [X(C25H22N2)]
dipole: 2.4692239 0.000676 -0.0260912 debye
polarizability: 496.5678646|-0.1091579|377.7860961|-4.3084252|-14.1593164|131.5887027 unknown
InChI: InChI=1S/C25H22N2/c1-27(2)23-15-13-19(14-16-23)22-17-24(20-9-5-3-6-10-20)26-25(18-22)21-11-7-4-8-12-21/h3-18H,1-2H3
charge 0 multiplicity 1
49 atoms
N  6.423091 -0.001793 -0.059827
N  -2.208583 0.00005 0.036932
C  0.647061 -0.000784 0.003141
C  2.130979 -0.001258 -0.013358
C  -1.513982 -1.17985 -0.034092
C  -1.51169 1.179361 0.090703
C  -0.097019 -1.208294 -0.077838
C  -0.094098 1.207241 0.100905
C  5.026271 -0.001511 -0.044606
C  2.881882 -1.098998 0.491377
C  2.871056 1.096356 -0.534128
C  -2.334711 -2.427922 -0.091804
C  -2.32946 2.428226 0.166851
C  4.285709 -1.108304 0.483941
C  4.274706 1.105448 -0.556945
C  -1.782147 -3.70792 0.185999
C  -3.713253 -2.344544 -0.428602
C  -1.784368 3.705732 -0.135919
C  -3.696895 2.348219 0.546627
C  7.164194 -1.157364 0.461282
C  7.153391 1.154964 -0.593362
C  -2.580876 -4.869611 0.118377
C  -4.511318 -3.504745 -0.497427
C  -2.579473 4.868757 -0.050832
C  -4.491173 3.509853 0.633427
C  -3.949153 -4.774866 -0.226582
C  -3.936364 4.777604 0.337337
H  0.427158 -2.157018 -0.221199
H  0.433468 2.15591 0.231848
H  2.356683 -1.953517 0.933948
H  2.336591 1.951106 -0.964998
H  4.808856 -1.972515 0.902459
H  4.788773 1.969739 -0.986372
H  -0.731325 -3.803492 0.480748
H  -4.131331 -1.354351 -0.632263
H  -0.743113 3.797539 -0.464052
H  -4.109628 1.359712 0.768583
H  6.956195 -1.330498 1.537089
H  6.914504 -2.087623 -0.088383
H  8.245391 -0.979754 0.350689
H  8.236616 0.976011 -0.507588
H  6.916891 2.083878 -0.03553
H  6.921749 1.331449 -1.663728
H  -2.138462 -5.847027 0.342083
H  -5.57087 -3.420985 -0.764833
H  -2.143447 5.844259 -0.294484
H  -5.542013 3.429101 0.934082
H  -4.568561 -5.677359 -0.279662
H  -4.553001 5.681089 0.404086
