program: Gaussian 09
title: 000092924
version: EM64L-G09RevD.01
frameworkgroup: C1[X(C10H14FN3O4)]
method: RPBEPBE
basis: SDD
operation: Freq
keyword: #p
keyword: freq=noraman
keyword: PBEPBE/SDD
title: #p freq=noraman PBEPBE/SDD
converged: YES YES NO NO
title: Mulliken charges:
elementType: F O O O O N N N C C C C C C C C C C H H H H H H H H H H H H H H
charge: -0.205016 -0.259440 -0.431384 -0.444262 -0.268895 -0.218362 -0.041670 -0.373526 -0.126523 -0.555728 -0.002730 -0.043350 -0.380126 -0.180694 0.044030 0.112755 0.134032 -0.598454 0.211501 0.240238 0.289157 0.286529 0.285071 0.210714 0.216342 0.340819 0.353658 0.354113 0.330640 0.256106 0.207766 0.256689
chargesum: 0.00000
title: Mulliken charges with hydrogens summed into heavy atoms:
elementType: F O O O O N N N C C C C C C C C C C
charge: -0.205016 -0.259440 -0.090565 -0.090150 -0.268895 -0.218362 -0.041670 -0.042886 0.084977 -0.026333 0.283799 0.241721 0.046930 0.172964 0.044030 0.112755 0.134032 0.122108
polarizability: 2.00912017e+02 1.23196616e+01 1.49156050e+02 6.53102942e+00 -2.76835209e-01 8.85666448e+01
1716.lowfreq: -31.8303 -12.5188 -4.6728 -0.0010 -0.0007 -0.0006 11.6966 31.7695 44.3604
frequency: -31.8279 31.4771 44.3295 57.6523 97.0457 116.4300 124.8877 143.7350 159.6180 177.8679 200.8774 220.3336 250.0388 269.2979 281.3878 289.8428 307.9797 322.9594 341.7843 391.0209 433.6913 452.7731 458.9902 488.4211 503.5332 519.1115 546.8642 623.7496 659.6185 701.7406 704.1048 732.5198 738.1098 755.3194 804.6036 839.0828 859.8519 924.0010 941.5560 949.8241 970.0173 985.4655 1011.4083 1031.6931 1045.2219 1060.6470 1065.5588 1076.6087 1083.4052 1124.0472 1156.0581 1162.1746 1175.2177 1198.3129 1216.2699 1226.2576 1246.7049 1253.9026 1274.1784 1287.1469 1288.8340 1311.6366 1335.2626 1360.2554 1378.9004 1411.3037 1414.4180 1432.0808 1452.6989 1456.7402 1467.3887 1489.5278 1504.4668 1546.0017 1605.4339 1647.5511 2934.7726 2968.9286 2992.0900 2994.4587 3039.7474 3065.5120 3076.1082 3093.9140 3109.5070 3113.5430 3131.1846 3569.3595 3575.1939 3581.7118
redmass: 1.0220 4.2741 7.1955 5.6607 4.3601 6.1399 5.0166 4.5171 3.7244 4.3659 3.5815 5.6774 5.2637 1.3058 2.6015 1.4088 5.1027 6.8065 5.3236 7.4573 4.2920 7.0654 3.4143 5.5725 3.0329 1.1348 4.8484 5.5444 4.9468 10.4088 5.7146 6.2114 10.0141 4.6363 3.5508 3.5983 3.2549 3.0317 2.2432 1.5760 4.1826 1.9912 6.0810 2.9774 3.1244 2.9084 2.3413 4.6449 2.6014 1.2873 1.2629 2.2815 1.3270 1.1914 3.1644 1.2493 1.4292 1.4696 1.5994 1.4237 1.5496 1.5420 1.2379 1.4829 1.5337 1.4971 1.9733 1.3072 1.0397 1.0890 1.0785 1.0928 3.3718 3.8370 8.6250 7.9396 1.0564 1.0854 1.1038 1.0341 1.0645 1.0880 1.1010 1.0884 1.1016 1.1019 1.0964 1.0663 1.0667 1.0780
irintensity: 0.1193 2.7102 4.0012 2.0864 17.6731 2.2975 4.4965 2.6640 4.6503 6.2143 13.7956 1.1520 1.2141 152.1462 48.3807 114.9648 27.4421 10.5673 7.1125 1.2801 1.3319 0.7012 4.5573 0.8430 28.2992 110.6587 11.4570 13.1915 13.8318 4.6026 18.4454 1.3391 27.6266 3.4975 12.9659 26.4974 23.4247 12.0746 79.5865 24.8585 62.0764 23.6078 130.9918 78.1003 57.4324 57.3404 12.5912 23.3693 8.3410 1.9409 55.6542 10.9961 4.6893 32.3376 2.1248 2.4943 10.3145 35.9154 234.0316 6.5807 16.6374 18.5907 0.8628 15.6419 2.4078 1.5782 7.2262 50.7836 14.0451 12.7749 9.1380 0.4668 96.3434 594.2320 227.0938 354.1305 38.6226 56.3335 77.2208 46.3302 12.4806 7.5587 23.7785 16.2578 13.3145 25.1022 75.5793 8.6092 7.5254 84.4100
temp: 298.150 k
press: 1.00000 atm
elementType: 9 8 8 8 8 7 7 7 6 6 6 6 6 6 6 6 6 6 1 1 1 1 1 1 1 1 1 1 1 1 1 1
symmnumber: 1
zpe: 642782.6 jmol-1
zpe.correction: 0.244823 hartree
zpe.thermalcorrener: 0.261977 hartree
zpe.thermalcorrenthalpy: 0.262921 hartree
zpe.thermalcorrgfe: 0.199579 hartree
zpe.sumelectzpe: -953.051383 hartree
zpe.sumelectthermal: -953.034229 hartree
zpe.sumelectthermalent: -953.033285 hartree
zpe.sumelectthermalfe: -953.096627 hartree
dipole: 0.0742 3.4100 4.4542
dipole: 5.6102
quadrupole: -85.4803 -110.5388 -104.0414
quadrupole: 9.7485 -10.5540 5.9242
quadrupole: 14.5399 -10.5186 -4.0212 9.7485 -10.5540 5.9242
hfenergy: -953.2962062 hartree
pointgroup: C01 [X(C10H14F1N3O4)]
dipole: 0.051132 -1.5110365 1.6080871 debye
polarizability: 199.0005338|16.3624058|150.5404568|-3.9164285|6.2753648|89.093722 unknown
InChI: InChI=1S/C10H14FN3O4/c1-12-9-5(11)3-14(10(17)13-9)8-2-6(16)7(4-15)18-8/h3,6-8,12,15-16H,2,4H2,1H3
charge 0 multiplicity 1
32 atoms
F  -2.118699 -2.646608 -0.570614
O  2.108211 -0.107185 -1.090525
O  4.348886 1.570255 0.057822
O  2.287837 -2.767318 -0.16973
O  -0.741737 2.617137 0.189191
N  -0.117528 0.429308 -0.333661
N  -2.432331 0.972043 0.165232
N  -4.050758 -0.734207 0.120992
C  3.345226 0.763898 0.763813
C  1.941834 1.419812 0.783778
C  1.27794 0.954473 -0.542018
C  3.133725 -0.501195 -0.08974
C  2.684106 -1.701307 0.758262
C  -0.431262 -0.899978 -0.544262
C  -1.124177 1.419213 0.025082
C  -1.735626 -1.294109 -0.37748
C  -2.749319 -0.32809 -0.022017
C  -5.126798 0.204696 0.460291
H  3.697988 0.525655 1.78946
H  1.354794 1.061176 1.64695
H  1.974343 2.518598 0.843779
H  1.204143 1.766364 -1.283354
H  4.033811 -0.754785 -0.671226
H  1.835936 -1.421504 1.420567
H  3.539752 -2.017247 1.392412
H  4.347584 2.489439 0.426278
H  0.380455 -1.576203 -0.838083
H  2.106739 -3.598338 0.336682
H  -4.260817 -1.719121 -0.040651
H  -4.918369 0.707103 1.420984
H  -6.075751 -0.351077 0.532732
H  -5.218139 0.993202 -0.307546
