program: Gaussian 09
title: 000092869
version: EM64L-G09RevD.01
frameworkgroup: C1[X(C12H22O)]
method: RPBEPBE
basis: SDD
operation: Freq
keyword: #pfreq=noraman
keyword: PBEPBE/SDD
title: #p freq=noraman PBEPBE/SDD
converged: NO YES NO NO
title: Mulliken charges:
elementType: O C C C C C C C C C C C C H H H H H H H H H H H H H H H H H H H H H H
charge: -0.472708 0.490202 -0.126470 -0.482214 -0.528457 -0.527020 -0.422579 -0.412912 -0.479002 -0.409943 -0.387110 -0.365151 -0.417735 0.184692 0.251999 0.181658 0.195414 0.234455 0.213674 0.195360 0.193917 0.190679 0.196137 0.190821 0.175483 0.226881 0.203826 0.198187 0.196399 0.190724 0.193045 0.194532 0.196903 0.202849 0.333463
chargesum: 0.00000
title: Mulliken charges with hydrogens summed into heavy atoms:
elementType: O C C C C C C C C C C C C
charge: -0.139244 0.490202 0.058222 -0.048557 -0.098587 -0.117986 -0.037984 -0.025954 -0.076639 -0.007930 0.000013 0.022426 -0.017983
polarizability: 1.41972286e+02 -5.29201115e-01 1.23267643e+02 -4.93360874e-01 3.51445491e-01 1.11165068e+02
1716.lowfreq: -12.2034 -11.0990 -0.0004 0.0001 0.0003 20.0743 93.3264 112.9827 136.6591
frequency: 93.2399 112.9499 136.6197 165.9746 182.5838 235.5629 243.7249 254.1075 282.7274 323.1501 328.1428 347.1987 362.6125 403.1449 425.6965 450.1783 483.3309 506.4533 557.8651 588.6566 664.2212 737.0316 777.5752 780.1303 821.0654 840.1439 861.5569 879.3663 896.0751 913.7565 926.7642 931.8720 963.5633 980.1690 987.4919 1028.8896 1047.9980 1056.8069 1070.8521 1074.8367 1102.3622 1102.9975 1128.6766 1140.6502 1150.5788 1174.2286 1199.0162 1206.8849 1215.1111 1241.0871 1253.3319 1266.4492 1273.6721 1282.4812 1290.1892 1307.5794 1320.5322 1331.5489 1335.1095 1338.2344 1340.7480 1349.0504 1349.7434 1354.3256 1364.9754 1366.7181 1389.1595 1460.6750 1463.2253 1463.9351 1465.3027 1467.1449 1470.3316 1475.9286 1481.7059 1488.5153 1490.8306 2901.2640 2941.0886 2956.0963 2960.9622 2963.7614 2965.8115 2967.8745 2972.0878 2973.4982 2977.2028 2986.6023 3007.0525 3014.5443 3019.2389 3021.0263 3023.7830 3027.1738 3032.8454 3036.7153 3045.1564 3052.1453 3564.4207
redmass: 3.3457 2.8377 2.3389 2.8571 2.4122 1.1070 2.9501 2.0820 2.3354 1.9375 2.9555 2.4154 2.2486 3.0756 2.6979 2.9429 1.8815 2.0095 2.0792 2.8557 2.7425 1.5419 2.0228 1.4930 1.8915 2.5766 1.9830 1.7893 2.0461 2.2558 1.8851 1.5616 2.5432 2.1984 2.6172 1.9992 2.1286 1.7566 1.5070 1.8450 1.8498 1.7628 1.3512 2.1425 1.4644 2.4128 1.3472 1.1728 1.5102 1.2907 1.2854 1.2295 1.3425 1.1398 1.1629 1.5266 1.4063 1.3955 1.3632 1.4853 1.4827 1.3447 1.4248 1.5038 1.3817 1.4739 1.4477 1.0879 1.0863 1.0871 1.0876 1.0857 1.0777 1.0836 1.0882 1.0799 1.0890 1.0834 1.0653 1.0648 1.0623 1.0608 1.0592 1.0638 1.0621 1.0643 1.0674 1.0617 1.0958 1.0954 1.0982 1.0944 1.0951 1.0990 1.1020 1.1013 1.1008 1.0974 1.0661
irintensity: 1.2601 1.3051 2.2027 0.5787 0.4127 119.3869 5.0735 0.3658 3.3471 1.0550 1.9875 1.1294 5.1661 0.3587 2.1207 0.0441 0.0062 0.8892 3.0611 15.8220 1.2469 8.5332 5.6193 1.0688 5.1071 6.8076 6.6910 13.9919 13.6730 3.0563 3.5643 8.2317 11.0839 6.7871 39.7388 0.4592 6.8194 2.6211 12.0238 4.6362 16.0744 0.4135 1.3349 1.0312 1.3741 0.2120 27.8345 6.3920 2.0156 4.5238 1.1427 1.3629 0.8622 1.5043 1.4011 4.1466 0.6910 2.3056 0.1879 0.7102 1.3446 1.2929 1.2281 2.6891 1.6434 1.3796 6.1598 6.8546 2.3256 7.2116 3.0610 8.6394 14.5382 4.7398 15.9473 29.4588 5.3725 46.3878 49.4665 4.6697 32.3591 30.9665 26.9074 44.4541 47.5566 73.4417 35.6279 24.2790 22.2806 58.2010 56.4625 41.1240 51.6149 55.1312 53.6173 128.7775 16.7456 74.6972 2.8218
temp: 298.150 k
press: 1.00000 atm
elementType: 8 6 6 6 6 6 6 6 6 6 6 6 6 1 1 1 1 1 1 1 1 1 1 1 1 1 1 1 1 1 1 1 1 1 1
symmnumber: 1
zpe: 837610.1 jmol-1
zpe.correction: 0.319029 hartree
zpe.thermalcorrener: 0.331822 hartree
zpe.thermalcorrenthalpy: 0.332766 hartree
zpe.thermalcorrgfe: 0.281595 hartree
zpe.sumelectzpe: -544.625514 hartree
zpe.sumelectthermal: -544.612721 hartree
zpe.sumelectthermalent: -544.611777 hartree
zpe.sumelectthermalfe: -544.662948 hartree
dipole: -1.8143 -0.1529 -0.3683
dipole: 1.8576
quadrupole: -80.1337 -80.5964 -82.3956
quadrupole: -4.2217 -0.1132 -0.0631
quadrupole: 0.9082 0.4455 -1.3537 -4.2217 -0.1132 -0.0631
hfenergy: -544.9445429 hartree
pointgroup: C01 [X(C12H22O1)]
dipole: -0.7132645 0.0680025 0.1441163 debye
polarizability: 141.9805353|0.3256012|123.2587482|0.5284712|0.3392664|111.1657133 unknown
InChI: InChI=1S/C12H22O/c13-11-7-3-1-4-8-12(11)9-5-2-6-10-12/h11,13H,1-10H2
charge 0 multiplicity 1
35 atoms
O  -0.224234 -2.563344 -0.382093
C  0.260181 -0.252643 0.270742
C  -0.829676 -1.3724 0.272562
C  1.503426 -0.839931 1.026276
C  0.680276 0.12215 -1.180421
C  -0.279632 0.9644 1.092082
C  2.770553 0.043852 0.948219
C  1.936074 1.026193 -1.240634
C  -2.181749 -1.078184 -0.414972
C  -1.194234 2.009856 0.400788
C  3.135334 0.370556 -0.517755
C  -3.001748 0.117865 0.128204
C  -2.465431 1.491032 -0.337499
H  -1.032602 -1.621949 1.341557
H  1.728699 -1.830931 0.591377
H  1.229328 -1.010599 2.088885
H  -0.157089 0.61623 -1.708211
H  0.887983 -0.81993 -1.724181
H  0.585527 1.525244 1.495524
H  -0.802076 0.559909 1.984867
H  3.610236 -0.47914 1.446798
H  2.622402 0.992644 1.503933
H  1.722713 2.008965 -0.771997
H  2.192223 1.230085 -2.299005
H  -2.799321 -1.99797 -0.312763
H  -2.010126 -0.941028 -1.501122
H  -0.591698 2.606786 -0.312103
H  -1.508297 2.71988 1.192674
H  4.021668 1.033676 -0.557701
H  3.406965 -0.567453 -1.044837
H  -3.057356 0.075257 1.235089
H  -4.042365 0.009013 -0.2367
H  -2.266339 1.418503 -1.425646
H  -3.266014 2.249283 -0.229233
H  -0.926503 -3.253376 -0.487404
