program: Gaussian 09
title: 000092938
version: EM64L-G09RevD.01
frameworkgroup: C1[X(C12H16N4O4)]
method: RPBEPBE
basis: SDD
operation: Freq
keyword: #p
keyword: freq=noraman
keyword: PBEPBE/SDD
title: #p freq=noraman PBEPBE/SDD
converged: YES YES NO NO
title: Mulliken charges:
elementType: O O O O N N N N C C C C C C C C C C C C H H H H H H H H H H H H H H H H
charge: -0.412880 -0.413340 -0.230774 -0.229596 -0.072523 -0.075606 0.008962 0.008661 0.177610 0.180494 -0.407737 -0.413042 -0.510726 -0.511995 -0.695476 -0.692114 -0.197667 -0.200969 0.184194 0.185261 0.248718 0.246968 0.252371 0.248819 0.277220 0.276013 0.278230 0.273291 0.247887 0.241296 0.237579 0.241397 0.246050 0.240447 0.381381 0.381597
chargesum: 0.00000
title: Mulliken charges with hydrogens summed into heavy atoms:
elementType: O O O O N N N N C C C C C C C C C C C C
charge: -0.031499 -0.031744 -0.230774 -0.229596 -0.072523 -0.075606 0.008962 0.008661 0.177610 0.180494 0.087948 0.088148 0.042507 0.039526 0.031286 0.035781 -0.197667 -0.200969 0.184194 0.185261
polarizability: 1.74377330e+02 2.48881680e+00 1.68519219e+02 -7.32244446e-01 -2.09208126e+00 1.48656312e+02
1716.lowfreq: -12.8198 -3.6201 -0.0009 -0.0007 -0.0005 2.2460 8.7507 21.2548 25.2401
frequency: -3.0980 20.9771 25.1933 31.8804 40.0575 62.1207 76.9272 78.7793 90.1334 108.0755 114.8400 140.2059 152.0753 164.1616 184.1790 211.5652 214.4958 230.5751 241.6791 265.6025 278.1574 302.8644 316.2230 376.6785 413.0516 441.4792 459.7634 464.0599 465.9775 506.8284 509.7020 554.3358 566.3199 583.5759 591.5504 599.0029 616.3132 640.7274 642.6139 705.4283 725.4619 741.0339 820.5892 835.6183 847.1579 876.4574 886.1379 934.0890 943.4053 1007.2629 1008.7859 1029.5246 1038.7656 1052.1647 1056.8600 1105.0703 1106.6083 1117.9655 1129.4862 1173.1219 1183.4727 1216.1609 1222.0382 1248.0558 1250.5992 1290.3818 1292.8383 1317.2900 1319.7756 1371.6015 1373.0104 1386.0521 1387.9522 1438.9356 1440.5574 1446.4758 1447.5156 1459.7337 1464.6051 1469.5439 1471.7922 1472.2509 1666.2857 1666.9030 2191.8608 2193.6954 2993.9571 2995.0946 3000.9226 3001.2916 3020.7474 3023.4067 3063.8126 3063.9717 3086.0065 3088.7841 3107.5513 3109.8256 3113.6011 3115.4971 3513.6837 3515.3197
redmass: 7.1205 10.4613 11.6183 7.5206 6.7207 5.6475 5.7923 7.4199 3.5453 3.4970 3.0761 4.0065 6.8967 4.1512 3.0236 2.1027 2.3924 1.1735 1.2706 6.0451 4.6759 3.9984 4.1144 5.5402 5.6153 4.2612 3.9797 3.7152 4.9672 1.9199 1.9530 5.0393 5.2793 5.1536 7.7040 4.4550 5.1266 1.3547 1.3569 4.5645 1.9568 1.8151 2.2193 7.1359 2.6800 3.4925 3.8530 1.8604 1.8244 1.6321 1.6505 4.5647 3.9230 2.2424 2.3592 2.4523 2.5858 2.1656 2.2608 2.1281 1.6636 1.7632 1.9611 1.5231 1.5357 1.2636 1.2643 1.5130 1.4935 1.5181 1.5189 1.3526 1.3357 1.0738 1.0800 1.0888 1.0916 2.0373 1.0550 1.6869 1.0898 1.0668 8.1992 8.2385 12.6438 12.6437 1.0650 1.0649 1.0344 1.0340 1.0600 1.0603 1.0944 1.0940 1.1016 1.1021 1.1012 1.1015 1.1011 1.1013 1.0640 1.0640
irintensity: 0.6682 1.4012 0.2629 0.8105 0.0586 4.9285 5.2166 3.7965 0.0316 0.3453 4.2961 4.2632 0.0154 0.0581 1.7146 1.3412 0.8064 0.6379 1.2591 3.6935 0.0770 3.7130 0.0416 0.1401 0.0880 2.5478 45.5817 3.8686 0.1269 35.2512 39.2189 0.2835 56.8468 1.0597 6.6144 0.1242 4.3050 125.1454 107.1527 5.0811 0.3708 58.7590 0.0571 0.1169 1.4125 3.7082 0.0184 34.1149 0.1703 15.3974 0.7551 1.7749 194.1013 5.5147 264.2892 14.5140 63.3507 1.3442 27.0460 20.0197 0.1225 35.4617 7.4249 2.7853 1.9420 22.4515 24.0309 39.5506 64.6075 32.9964 0.1473 0.3709 63.5481 9.5681 0.4378 7.1185 64.1007 0.2159 34.8111 0.9591 1.0270 25.0753 204.9394 217.6666 2.8213 1.8306 7.1411 7.0985 8.8081 5.0437 8.6492 8.1571 1.9814 1.6572 6.0328 6.1016 12.5092 11.2299 12.5676 15.1415 27.6038 27.0139
temp: 298.150 k
press: 1.00000 atm
elementType: 8 8 8 8 7 7 7 7 6 6 6 6 6 6 6 6 6 6 6 6 1 1 1 1 1 1 1 1 1 1 1 1 1 1 1 1
symmnumber: 1
zpe: 714329.7 jmol-1
zpe.correction: 0.272074 hartree
zpe.thermalcorrener: 0.293925 hartree
zpe.thermalcorrenthalpy: 0.294870 hartree
zpe.thermalcorrgfe: 0.218628 hartree
zpe.sumelectzpe: -985.197275 hartree
zpe.sumelectthermal: -985.175423 hartree
zpe.sumelectthermalent: -985.174479 hartree
zpe.sumelectthermalfe: -985.250720 hartree
dipole: 0.2078 -0.2954 -0.1142
dipole: 0.3788
quadrupole: -116.4842 -127.1457 -129.9603
quadrupole: -15.0200 -5.9159 19.3778
quadrupole: 8.0458 -2.6156 -5.4302 -15.0200 -5.9159 19.3778
hfenergy: -985.4693485 hartree
pointgroup: C01 [X(C12H16N4O4)]
dipole: 0.0837788 0.1038018 0.0664568 debye
polarizability: 174.3270114|-2.6114702|168.579137|-0.1603305|2.0887045|148.6467121 unknown
InChI: InChI=1S/C12H16N4O4/c1-11(7-13,5-3-9(17)18)15-16-12(2,8-14)6-4-10(19)20/h17,19H,3-6H2,1-2H3
charge 0 multiplicity 1
36 atoms
O  -5.069906 -1.272328 -0.826417
O  4.994772 1.00675 1.280393
O  -4.961569 -0.493671 1.358674
O  5.108758 0.394354 -0.956748
N  0.073582 0.667108 -0.095821
N  -0.083688 -0.601372 -0.073038
N  -1.739373 3.345044 -1.205561
N  1.499681 -3.503606 0.817784
C  -1.09254 1.440091 0.558426
C  1.081618 -1.366637 -0.736997
C  -2.338192 0.598673 0.947447
C  2.396714 -0.563285 -0.929954
C  -3.142623 0.03804 -0.238758
C  3.09802 -0.163634 0.380451
C  -0.451524 2.097202 1.816133
C  0.506198 -1.82945 -2.108511
C  -1.440024 2.495066 -0.424528
C  1.300268 -2.549555 0.130958
C  -4.451067 -0.576093 0.220203
C  4.473841 0.418984 0.11996
H  -1.991013 -0.236088 1.5822
H  -2.995887 1.2290 1.572394
H  2.152845 0.344145 -1.509835
H  3.083931 -1.169718 -1.546607
H  -2.570362 -0.729013 -0.788212
H  -3.392881 0.830356 -0.972364
H  3.233809 -1.038279 1.047732
H  2.508577 0.575609 0.949813
H  0.479082 2.624526 1.549964
H  -1.153795 2.82084 2.262157
H  -0.224277 1.315091 2.561152
H  1.203227 -2.536384 -2.588382
H  -0.467818 -2.329127 -1.977668
H  0.378255 -0.950717 -2.763697
H  -5.935517 -1.646974 -0.506773
H  5.907978 1.356452 1.09163
