program: Gaussian 09
title: 000092887
version: EM64L-G09RevD.01
frameworkgroup: C1[X(C10H14N2O6)]
method: RPBEPBE
basis: SDD
operation: Freq
keyword: #p
keyword: freq=noraman
keyword: PBEPBE/SDD
title: #p freq=noraman PBEPBE/SDD
converged: YES YES NO NO
title: Mulliken charges:
elementType: O O O O O O N N C C C C C C C C C C H H H H H H H H H H H H H H
charge: -0.251542 -0.469776 -0.450588 -0.463623 -0.288525 -0.243951 -0.217073 -0.388771 -0.299176 -0.037943 -0.113301 -0.036292 -0.394653 0.469660 0.232861 -0.442155 -0.799362 0.146310 0.320686 0.255786 0.256743 0.272347 0.214458 0.255248 0.369736 0.357865 0.257580 0.271084 0.255367 0.246585 0.360346 0.354070
chargesum: 0.00000
title: Mulliken charges with hydrogens summed into heavy atoms:
elementType: O O O O O O N N C C C C C C C C C C
charge: -0.251542 -0.100041 -0.092723 -0.109553 -0.288525 -0.243951 -0.217073 -0.028425 0.021510 0.217843 0.143442 0.236054 0.075054 0.469660 0.232861 -0.184575 -0.026326 0.146310
polarizability: 1.90908689e+02 2.51703351e+00 1.37799875e+02 2.11145490e+00 -9.30872976e+00 9.82266561e+01
1716.lowfreq: -6.4627 0.0003 0.0006 0.0006 2.0896 10.0301 32.9048 39.8958 59.2720
frequency: 32.7368 39.8913 59.2632 66.8345 107.7063 146.9924 166.2743 175.2077 184.6226 189.1965 217.2693 233.0694 239.5747 260.1994 275.6347 278.0218 343.7969 350.6750 375.8182 398.5043 444.7443 462.9336 500.0253 516.2826 539.0851 552.5316 563.7785 597.3624 604.3547 650.6920 684.1081 708.5742 727.5338 774.0715 818.7845 831.7916 844.8354 896.3566 908.5605 952.7397 972.6118 973.4066 989.9115 998.5439 1022.8191 1035.4654 1053.3052 1055.9982 1075.8605 1098.3306 1155.8969 1174.6512 1178.7510 1188.6069 1215.0178 1227.4888 1236.5998 1260.2524 1274.6493 1285.9747 1316.3908 1325.3231 1332.6944 1357.5239 1362.1326 1377.9416 1384.1959 1403.9723 1411.2080 1421.4847 1474.4010 1480.2320 1492.3609 1600.9957 1634.7427 1671.8939 2977.9504 2989.8920 3024.8237 3044.3522 3071.0857 3076.3700 3080.0561 3098.7856 3115.0381 3205.8963 3466.6285 3522.8881 3587.0898 3611.6529
redmass: 4.1845 8.3943 7.2552 5.5498 4.2648 6.2590 8.4668 4.7822 4.1697 3.8525 2.7717 1.3961 1.5014 3.3654 1.7872 1.5763 4.0240 5.6770 8.6247 4.6478 4.8554 3.1961 4.6634 3.1383 1.7307 3.1313 4.6026 6.5736 5.0435 5.3948 2.6758 2.8356 4.8887 2.0198 3.8874 1.5768 3.6250 3.5387 2.8788 3.2801 4.7041 7.3962 2.9131 3.5616 3.3215 2.3080 1.5497 2.0181 1.9583 2.3122 1.7078 2.2175 1.8688 1.2151 1.6682 1.4950 1.7676 1.1634 1.3390 1.2558 1.3037 2.8572 1.3579 1.5156 1.8524 1.8573 1.9359 1.2888 1.4603 1.7169 1.0479 1.0954 1.0780 5.7501 9.5973 6.1925 1.0578 1.0388 1.0870 1.1036 1.0985 1.0881 1.0854 1.0878 1.0972 1.0940 1.0644 1.0770 1.0668 1.0672
irintensity: 3.6473 2.2737 8.9981 4.0544 6.5021 2.0678 2.6266 1.6356 5.4579 14.1452 21.3224 129.8602 28.3210 32.4319 4.1897 6.6084 10.2868 3.4553 16.7531 6.4023 17.6134 27.1081 20.0427 129.1878 76.6328 9.0955 34.2140 5.0840 1.9066 15.3706 15.7621 10.1774 14.1915 76.3614 23.2936 51.6156 32.1481 38.9912 20.8022 3.6851 67.1517 196.9116 23.1995 98.5630 19.5681 56.3526 9.5062 10.3154 14.1619 5.0249 49.3378 10.5406 25.9794 21.1969 31.5734 2.4010 29.2577 7.7773 25.7082 47.0402 11.5071 63.3100 103.4575 23.2263 99.3526 43.9873 56.4951 21.1873 10.9212 72.7606 17.9492 14.5703 7.3359 76.1583 281.4356 799.8501 34.2736 7.8169 22.6260 15.4115 4.7972 27.2915 10.4709 5.7219 16.8224 0.6076 25.3602 57.9338 5.9815 24.0870
temp: 298.150 k
press: 1.00000 atm
elementType: 8 8 8 8 8 8 7 7 6 6 6 6 6 6 6 6 6 6 1 1 1 1 1 1 1 1 1 1 1 1 1 1
symmnumber: 1
zpe: 646668.8 jmol-1
zpe.correction: 0.246303 hartree
zpe.thermalcorrener: 0.263874 hartree
zpe.thermalcorrenthalpy: 0.264818 hartree
zpe.thermalcorrgfe: 0.200716 hartree
zpe.sumelectzpe: -948.928884 hartree
zpe.sumelectthermal: -948.911313 hartree
zpe.sumelectthermalent: -948.910369 hartree
zpe.sumelectthermalfe: -948.974471 hartree
dipole: 1.2618 1.3979 2.0543
dipole: 2.7868
quadrupole: -136.8232 -94.5762 -97.7217
quadrupole: -17.3164 8.0284 2.1994
quadrupole: -27.1161 15.1308 11.9853 -17.3164 8.0284 2.1994
hfenergy: -949.1751871 hartree
pointgroup: C01 [X(C10H14N2O6)]
dipole: -0.5147479 0.6142577 -0.7482339 debye
polarizability: 191.0208231|-1.1648357|135.4388776|1.3436948|13.1149214|100.4755202 unknown
InChI: InChI=1S/C10H14N2O6/c1-4-2-6(14)11-10(17)12(4)9-8(16)7(15)5(3-13)18-9/h2,5,7-9,11,13,15-16H,3H2,1H3
charge 0 multiplicity 1
32 atoms
O  -1.088724 -0.08726 1.166862
O  -1.322999 2.066336 -1.738489
O  -3.29758 1.775873 0.048881
O  -3.971196 -2.176094 0.078815
O  0.289765 -1.604886 -1.180169
O  4.837637 -0.985809 -0.404035
N  0.939526 0.36794 -0.041494
N  2.54355 -1.23404 -0.766428
C  -1.388824 0.739898 -1.099726
C  -0.469445 0.771669 0.148196
C  -2.786723 0.500394 -0.460791
C  -2.492469 -0.408561 0.741652
C  -2.566388 -1.911355 0.440651
C  1.989709 1.125229 0.537486
C  1.197871 -0.873731 -0.690176
C  3.298624 0.707437 0.42956
C  1.648453 2.399343 1.277441
C  3.671141 -0.524832 -0.250842
H  -1.119594 -0.069428 -1.794223
H  -0.464622 1.812681 0.50581
H  -3.50805 0.034685 -1.15736
H  -3.163956 -0.146053 1.575457
H  -2.2710 -2.464803 1.354629
H  -1.870541 -2.176344 -0.377781
H  -1.3460 1.970865 -2.721185
H  -2.998222 2.477096 -0.593742
H  4.10483 1.29596 0.867875
H  0.947854 2.212896 2.111591
H  1.194804 3.157189 0.612753
H  2.570742 2.827886 1.698218
H  2.733858 -2.122237 -1.241817
H  -4.098729 -3.148344 -0.048916
