program: Gaussian 09
title: 000092837
version: EM64L-G09RevD.01
frameworkgroup: C1[X(C10H18O3)]
method: RPBEPBE
basis: SDD
operation: Freq
keyword: #pfreq=noraman
keyword: PBEPBE/SDD
title: #p freq=noraman PBEPBE/SDD
converged: YES YES NO NO
title: Mulliken charges:
elementType: O O O C C C C C C C C C C H H H H H H H H H H H H H H H H H H
charge: -0.437732 -0.430862 -0.254644 -0.360787 -0.365693 -0.369018 -0.394347 -0.397584 -0.482454 -0.328774 -0.065596 -0.327742 0.167889 0.195717 0.187903 0.189528 0.214264 0.189927 0.197917 0.204111 0.207774 0.184372 0.218490 0.214351 0.221011 0.217040 0.182319 0.258343 0.328779 0.259561 0.375937
chargesum: 0.00000
title: Mulliken charges with hydrogens summed into heavy atoms:
elementType: O O O C C C C C C C C C C
charge: -0.108953 -0.054925 -0.254644 0.022832 0.038099 0.018826 0.017539 0.005278 -0.047092 0.070585 0.192747 -0.068181 0.167889
polarizability: 1.42117626e+02 -2.03597514e+01 1.23315735e+02 -3.85768714e+00 2.60059634e+00 1.01753483e+02
1716.lowfreq: -8.0036 -5.7832 -3.7419 -0.0010 -0.0004 -0.0003 21.0604 31.2385 39.0712
frequency: 20.9499 31.1970 39.0256 55.5305 70.5798 98.0191 110.3409 142.6837 144.0884 151.2119 175.3942 208.5931 243.8462 306.0446 327.2044 353.6179 373.8476 447.1720 478.0604 505.3859 587.3529 600.0159 685.9691 724.2172 744.4359 784.7503 817.1107 860.2585 892.3921 903.8689 943.1160 947.2290 986.4770 1000.9662 1012.1391 1021.9710 1041.0720 1061.5027 1071.7412 1077.6520 1087.2749 1106.8247 1152.9043 1176.4835 1210.7242 1224.3100 1239.5384 1258.6256 1274.2383 1279.8393 1283.6192 1292.1895 1293.5226 1309.3944 1316.8614 1340.1901 1348.4591 1357.5561 1358.1824 1381.6514 1452.1014 1461.3953 1462.9002 1465.2695 1471.3210 1481.1498 1488.3264 1640.1172 1662.0899 2946.3072 2954.1710 2956.3466 2957.5027 2960.8470 2966.0194 2974.0238 2991.5326 3005.2006 3018.7683 3029.6582 3037.8220 3047.3369 3073.3316 3090.0209 3156.2750 3524.2541 3560.0411
redmass: 6.2881 6.5404 1.7150 4.3306 4.6211 1.8052 3.0350 2.5389 3.0982 2.3833 3.2844 3.0300 3.2266 1.5311 1.9180 4.0377 2.7919 3.6444 3.4475 2.6753 1.3717 3.5985 2.6289 1.0826 1.1530 1.2234 1.8013 1.3509 2.0794 4.2985 2.2721 2.2329 1.8742 1.7576 1.4254 2.9613 3.1599 1.9392 2.0760 2.3501 2.1304 1.5353 1.8642 1.3167 1.4706 1.3575 1.3776 1.3612 1.2969 1.1532 1.1189 1.1234 1.1426 1.4672 1.3042 1.3370 1.8245 1.6323 1.4836 1.2572 1.1016 1.0732 1.0818 1.0639 1.0914 1.0950 1.0984 8.5444 6.2368 1.0688 1.0591 1.0603 1.0613 1.0625 1.0619 1.0606 1.0953 1.0981 1.0999 1.0986 1.0999 1.1029 1.0978 1.0909 1.0926 1.0640 1.0661
irintensity: 0.1215 0.8183 2.5212 2.5260 0.5258 1.8883 1.5257 0.5992 1.5734 1.6350 0.7095 0.2286 0.3268 71.3033 88.6162 13.5782 3.9936 8.0215 3.5916 15.3692 100.1020 28.9478 64.2540 11.5567 2.1700 3.4864 8.7024 19.4358 8.3884 6.8094 37.4168 22.4323 81.6266 39.3456 86.3627 35.8298 78.8132 139.9599 16.7747 2.6374 8.6338 26.9372 18.7377 7.9095 3.8744 11.6368 6.0090 2.7983 9.5326 4.4191 7.1291 0.7501 0.7206 9.0946 7.3778 5.0216 59.0526 4.0205 0.5449 26.2915 18.2254 0.2505 0.3606 0.3818 0.1676 0.6947 18.6783 249.8347 111.9600 54.4143 1.2939 4.6682 15.2814 10.6028 75.5200 102.6723 5.7268 4.4414 0.8852 20.4445 4.0781 155.6810 65.0343 9.0528 6.1220 38.6074 6.6925
temp: 298.150 k
press: 1.00000 atm
elementType: 8 8 8 6 6 6 6 6 6 6 6 6 6 1 1 1 1 1 1 1 1 1 1 1 1 1 1 1 1 1 1
symmnumber: 1
zpe: 694872.1 jmol-1
zpe.correction: 0.264663 hartree
zpe.thermalcorrener: 0.280650 hartree
zpe.thermalcorrenthalpy: 0.281594 hartree
zpe.thermalcorrgfe: 0.218038 hartree
zpe.sumelectzpe: -616.463361 hartree
zpe.sumelectthermal: -616.447374 hartree
zpe.sumelectthermalent: -616.446429 hartree
zpe.sumelectthermalfe: -616.509986 hartree
dipole: 0.0358 2.8733 -2.2855
dipole: 3.6716
quadrupole: -97.0417 -76.3422 -84.2669
quadrupole: -11.6546 2.0680 2.2671
quadrupole: -11.1581 9.5414 1.6167 -11.6546 2.0680 2.2671
hfenergy: -616.7280237 hartree
pointgroup: C01 [X(C10H18O3)]
dipole: 0.0218436 1.1714202 -0.8449594 debye
polarizability: 141.8176442|-20.2881303|123.3151407|-4.8194406|3.6551689|102.0540598 unknown
InChI: InChI=1S/C10H18O3/c11-9-7-5-3-1-2-4-6-8-10(12)13/h6,8,11-12H,1-5,7,9H2
charge 0 multiplicity 1
31 atoms
O  -6.499343 -1.135199 0.147361
O  4.6797 -1.914365 -0.950933
O  4.185005 -1.430001 1.271426
C  -1.902403 1.044221 0.232266
C  -0.435678 0.960789 -0.245796
C  -2.775139 -0.123486 -0.280916
C  0.43437 2.122381 0.282967
C  -4.247042 -0.029054 0.183213
C  1.89974 2.088905 -0.240052
C  -5.107217 -1.197112 -0.331092
C  2.671892 0.892456 0.25246
C  3.335137 -0.000403 -0.535094
C  4.072595 -1.136177 0.054741
H  -1.927579 1.058656 1.341761
H  -2.343683 2.00685 -0.101542
H  -0.410199 0.960715 -1.355803
H  0.002406 -0.006039 0.074151
H  -2.735838 -0.148693 -1.390312
H  -2.34193 -1.08397 0.067067
H  0.441736 2.104149 1.392135
H  -0.021417 3.088478 -0.012683
H  -4.68091 0.931647 -0.168961
H  -4.29584 -0.014507 1.289592
H  1.906311 2.122888 -1.346349
H  2.414218 3.006678 0.11608
H  -4.730573 -2.158002 0.059292
H  -5.074401 -1.237588 -1.442285
H  2.703278 0.7314 1.342045
H  -6.902854 -0.284863 -0.161693
H  3.351784 0.084624 -1.62643
H  5.167072 -2.667781 -0.520215
