program: Gaussian 09
title: 000092830
version: EM64L-G09RevD.01
frameworkgroup: C1[X(C14H12O2)]
method: RPBEPBE
basis: SDD
operation: Freq
keyword: #pfreq=noraman
keyword: PBEPBE/SDD
title: #p freq=noraman PBEPBE/SDD
converged: YES YES NO YES
title: Mulliken charges:
elementType: O O C C C C C C C C C C C C C C H H H H H H H H H H H H
charge: -0.429563 -0.429732 0.527542 0.527934 -0.337304 -0.336604 -0.374362 -0.375822 -0.393734 -0.392567 -0.395782 -0.357794 -0.362988 -0.399061 0.278066 0.275699 0.215153 0.212195 0.222340 0.225298 0.229299 0.226074 0.217464 0.249749 0.250797 0.218883 0.354130 0.354692
chargesum: 0.00000
title: Mulliken charges with hydrogens summed into heavy atoms:
elementType: O O C C C C C C C C C C C C C C
charge: -0.075433 -0.075040 0.527542 0.527934 -0.122151 -0.124409 -0.152022 -0.150525 -0.164435 -0.166493 -0.178318 -0.108045 -0.112191 -0.180178 0.278066 0.275699
polarizability: 3.89717519e+02 6.65167699e+00 1.53817862e+02 3.58866141e-03 6.33629494e-03 6.15458413e+01
1716.lowfreq: -2.3711 -0.0010 -0.0009 -0.0007 4.0896 5.8513 24.5946 39.2789 62.0635
frequency: 24.5935 39.2775 62.0634 79.6633 171.8298 181.7574 188.8941 243.8170 334.4232 358.6975 359.9415 363.1571 385.5046 397.7211 410.9683 414.7107 461.8834 477.1451 498.2854 535.1697 565.9525 633.2592 640.1302 714.6285 734.3219 758.4312 788.8730 799.1462 804.2798 823.1867 831.3615 836.4067 867.4883 884.2630 929.9058 935.3928 957.7249 960.4960 982.5771 999.3380 999.9300 1101.2883 1104.5616 1142.7238 1147.0977 1180.3834 1182.5457 1201.5254 1234.5080 1252.2234 1262.0700 1290.5084 1303.6671 1332.0898 1336.8705 1387.4683 1398.5221 1430.0728 1435.9357 1498.4737 1511.2831 1584.6421 1587.5835 1616.0041 1627.0133 1646.7067 3084.6490 3095.9041 3109.9167 3110.7395 3126.6066 3135.7438 3139.7920 3146.9576 3169.8542 3171.2466 3581.0066 3581.6662
redmass: 3.5010 6.8875 5.6117 5.0595 6.5554 2.5012 5.7837 6.3537 3.4401 1.1250 4.6289 1.1279 4.3121 3.8513 2.8943 3.2219 8.4174 3.8913 2.3986 2.3559 6.7368 7.0982 6.9027 3.3179 3.4999 5.7014 5.5933 1.3755 1.3367 1.4150 6.1047 1.6089 4.3612 1.9300 1.3653 1.4611 1.3571 1.3709 1.1622 2.7793 2.7384 1.4768 1.4829 1.3873 1.3416 1.1103 1.1138 2.6568 1.5344 2.6024 1.9806 2.5558 1.5311 1.3929 1.2601 4.6529 4.1204 3.6466 3.1240 2.6183 2.8978 6.1643 5.9968 5.9061 6.3668 5.4243 1.0912 1.0860 1.0887 1.0874 1.0895 1.0956 1.0888 1.0944 1.0961 1.0953 1.0660 1.0660
irintensity: 0.0002 0.3297 0.1382 0.1600 0.8386 0.0040 0.0042 2.6963 0.6757 119.5094 1.0502 175.5678 1.8386 29.6076 0.0675 0.5227 43.6502 0.4463 0.1800 64.9543 0.4320 1.6002 0.3761 0.0143 2.4190 36.8218 0.1703 1.0771 32.2796 3.0804 23.4959 104.0228 0.9025 0.1424 3.6498 0.0541 4.9961 2.2745 54.0657 0.0122 2.1668 22.9695 132.2007 410.8249 190.8102 15.2557 1.9963 0.1034 23.0036 2.0198 112.0789 28.7870 1.7028 0.0615 12.8268 53.4782 4.4015 8.2276 0.8342 5.5813 276.3330 15.5201 3.0409 1.6659 143.2845 0.4745 1.7120 48.2670 30.0004 20.5665 14.8987 26.9162 2.5522 14.3570 10.3673 11.0827 112.1587 40.2137
temp: 298.150 k
press: 1.00000 atm
elementType: 8 8 6 6 6 6 6 6 6 6 6 6 6 6 6 6 1 1 1 1 1 1 1 1 1 1 1 1
symmnumber: 1
zpe: 572332.1 jmol-1
zpe.correction: 0.217990 hartree
zpe.thermalcorrener: 0.231901 hartree
zpe.thermalcorrenthalpy: 0.232846 hartree
zpe.thermalcorrgfe: 0.176015 hartree
zpe.sumelectzpe: -690.003398 hartree
zpe.sumelectthermal: -689.989487 hartree
zpe.sumelectthermalent: -689.988542 hartree
zpe.sumelectthermalfe: -690.045373 hartree
dipole: 0.3839 3.1356 0.0082
dipole: 3.1590
quadrupole: -82.3703 -77.9787 -101.7496
quadrupole: 0.3986 -0.0284 0.0087
quadrupole: 4.9959 9.3875 -14.3834 0.3986 -0.0284 0.0087
hfenergy: -690.2213878 hartree
pointgroup: C01 [X(C14H12O2)]
dipole: -0.1582707 -1.232728 0.0022094 debye
polarizability: 389.7568799|5.264293|153.7473627|-3.1777962|0.1338395|61.5769796 unknown
InChI: InChI=1S/C14H12O2/c15-13-7-3-11(4-8-13)1-2-12-5-9-14(16)10-6-12/h1-10,15-16H
charge 0 multiplicity 1
28 atoms
O  6.181991 -0.209584 -0.060803
O  -6.16692 0.356576 0.061742
C  1.943384 0.224068 -0.017873
C  -1.949465 -0.244502 0.017557
C  0.493262 0.462509 -0.003383
C  -0.499825 -0.48396 0.0027
C  2.532203 -1.074493 -0.026076
C  -2.537914 1.057924 0.02596
C  2.829039 1.343553 -0.024265
C  -2.834648 -1.36032 0.024269
C  3.928497 -1.246463 -0.040285
C  -3.930109 1.235499 0.040577
C  4.226215 1.188511 -0.038325
C  -4.234493 -1.198887 0.038862
C  4.779528 -0.111928 -0.046412
C  -4.783812 0.10515 0.047138
H  0.205487 1.523808 0.003056
H  -0.212492 -1.545647 -0.003505
H  1.894901 -1.965172 -0.021252
H  -1.898022 1.946725 0.02095
H  2.406378 2.35575 -0.018085
H  -2.415063 -2.373815 0.01795
H  4.355988 -2.258048 -0.046456
H  -4.378497 2.233492 0.047032
H  4.898507 2.05135 -0.043083
H  -4.890191 -2.079528 0.043662
H  6.469682 -1.156224 -0.06235
H  -6.67891 -0.490044 0.065999
