program: Gaussian 09
title: 000092929
version: EM64L-G09RevD.01
frameworkgroup: C1[X(C20H21N7O6)]
method: RPBEPBE
basis: SDD
operation: Freq
keyword: #p
keyword: freq=noraman
keyword: PBEPBE/SDD
title: #p freq=noraman PBEPBE/SDD
converged: YES YES NO NO
title: Mulliken charges:
elementType: O O O O O O N N N N N N N C C C C C C C C C C C C C C C C C C C C H H H H H H H H H H H H H H H H H H H H H
charge: -0.398962 -0.293198 -0.242866 -0.419992 -0.225024 -0.192439 -0.131602 -0.460205 0.049954 -0.014970 -0.411254 -0.034621 -0.611492 -0.133462 -0.391283 0.440297 -0.599583 -0.484620 0.296650 0.149545 -0.363746 -0.355297 0.278848 -0.383090 -0.376940 0.112259 -0.677594 0.180031 -0.391280 -0.161310 0.170502 0.000269 0.156659 0.310836 0.249210 0.284288 0.267121 0.230558 0.255678 0.270422 0.340858 0.246032 0.201986 0.272734 0.204677 0.279125 0.237170 0.236390 0.254680 0.328713 0.388668 0.377184 0.320474 0.363012
chargesum: 0.00000
title: Mulliken charges with hydrogens summed into heavy atoms:
elementType: O O O O O O N N N N N N N C C C C C C C C C C C C C C C C C C C C
charge: -0.010294 -0.293198 -0.242866 -0.042808 -0.225024 -0.192439 -0.131602 -0.119347 0.049954 -0.014970 -0.082542 -0.034621 0.071994 0.177374 0.142215 0.440297 -0.101904 0.041480 0.296650 0.149545 -0.117714 -0.153311 0.278848 -0.110356 -0.172263 0.112259 0.075092 0.180031 -0.136600 -0.161310 0.170502 0.000269 0.156659
polarizability: 4.68411706e+02 -1.42987316e+01 2.77520511e+02 1.17907572e+01 1.72571869e+01 2.14284384e+02
1716.lowfreq: -6.0315 -4.4123 -0.0009 -0.0002 0.0009 0.6547 2.5970 7.2192 13.5901
frequency: -5.2520 5.8512 12.8632 17.7756 20.3756 33.3491 40.7369 42.6459 51.1012 60.3390 77.4089 87.2122 89.8991 94.0359 115.7693 136.4931 144.1124 157.3947 185.2915 186.7225 193.7223 205.3701 210.0809 234.6675 263.4759 294.0099 307.5161 311.7907 324.4611 333.5753 349.0683 374.7679 383.6338 415.2915 423.8019 439.8001 444.2446 452.6926 463.5752 483.7599 490.2289 501.7542 515.0751 536.8525 543.1393 554.5195 557.7955 565.3467 586.7544 589.3447 601.4772 615.3937 630.1713 633.9367 635.1262 637.0213 646.6976 683.0887 689.4232 698.0685 720.9568 730.6972 755.2155 762.2879 771.2427 794.6593 807.8836 816.5087 825.1408 837.7464 874.8446 899.3404 906.0909 918.8572 927.0187 932.1028 936.3786 968.0226 987.8660 990.9793 994.2545 1023.4709 1024.1258 1043.4563 1060.0647 1094.3622 1095.5023 1103.5658 1112.1966 1118.3916 1134.1526 1156.2301 1183.4754 1184.4806 1205.1491 1212.4140 1221.4986 1236.3893 1240.3516 1249.9241 1263.3578 1266.7047 1280.1742 1281.5641 1286.7915 1319.2977 1333.7185 1344.4104 1348.9228 1353.9282 1362.2004 1369.2774 1377.8115 1386.2579 1436.6173 1438.0932 1439.8349 1450.5985 1455.7313 1468.3259 1475.3869 1476.7537 1482.6621 1504.0802 1511.8459 1530.3603 1533.7817 1541.4934 1583.7864 1590.4885 1599.0904 1628.2247 1644.5044 1644.8511 1670.8985 2960.4144 2990.1162 2996.9938 3025.1177 3034.1711 3035.1976 3040.2764 3091.5496 3101.1122 3108.8117 3117.9984 3149.6125 3152.7884 3158.7055 3175.0809 3507.8738 3513.7122 3517.3115 3522.7995 3547.8535 3699.2692
redmass: 8.6100 7.2773 7.2343 12.3098 7.2747 6.1022 4.9017 6.7919 9.7026 5.2664 5.8092 5.7610 2.8717 3.5744 5.7734 5.9657 5.4873 5.5014 5.5937 4.1849 2.3560 2.4066 3.2635 4.4215 4.8881 4.5145 2.1485 1.6889 4.4512 4.5727 4.5388 5.9333 5.1919 2.8997 4.7650 7.0502 5.5466 3.9610 4.0301 3.5138 3.2974 1.8017 2.8907 4.0690 3.2844 1.4183 2.4023 3.6491 1.6521 2.8746 4.3406 2.7543 1.8895 6.2681 1.6196 1.4215 5.0023 3.5985 6.9676 9.1905 4.9570 5.7706 3.9901 5.1551 1.7325 1.4798 3.8929 8.9294 5.8491 1.6617 4.0649 4.4637 4.5884 2.1014 2.0065 1.5627 2.4029 3.3472 2.1809 1.3903 2.8788 2.7974 2.7600 2.7198 2.1561 2.1644 2.5232 2.5011 1.3087 3.7974 1.4618 1.6837 2.8818 1.8284 1.9220 1.2401 1.4349 2.7371 1.4180 2.7337 3.1682 1.6065 1.7495 1.9591 1.4625 1.3697 1.5248 3.2151 1.4292 2.4566 2.3925 4.0113 1.7719 2.1983 3.4396 4.0954 1.2046 1.3674 2.9626 1.1343 1.1869 1.6426 1.0653 1.2133 7.5133 3.0231 4.6356 5.1834 6.8061 3.1355 2.3475 6.1167 2.8582 8.2275 8.2298 1.0372 1.0610 1.0814 1.0630 1.1010 1.0631 1.0957 1.1006 1.1038 1.0977 1.0880 1.0885 1.0933 1.0925 1.0946 1.0778 1.0639 1.0644 1.0769 1.0456 1.1053
irintensity: 4.1463 1.2226 2.3086 0.6758 2.6245 1.3575 0.0716 3.7577 0.1761 1.8821 3.3053 0.8335 0.3834 1.7512 6.7841 2.0633 0.3610 6.4917 7.3620 8.0641 0.4149 5.1246 3.2877 5.4152 1.4066 8.8832 14.9449 38.3060 1.4229 6.1851 3.6067 5.1565 7.1152 0.4539 26.6083 12.4970 7.4200 13.5008 10.7198 3.7504 11.5509 32.3118 11.8740 76.6792 66.5678 193.3055 141.6598 6.8530 23.6416 5.1744 5.2865 22.1047 56.0019 1.8923 109.3507 126.8846 14.1978 43.5350 8.7494 21.3617 6.0550 7.2933 12.2360 14.4491 49.4182 12.4815 16.1346 4.4528 16.1091 40.9173 7.4167 14.4376 9.5108 37.6599 17.7596 4.6892 2.9633 8.5452 5.9731 1.2507 3.7090 37.8786 144.9316 281.9133 141.8122 27.4865 16.7436 83.7356 4.2053 3.7745 18.0072 4.9188 12.6484 8.8434 55.1248 172.1837 20.4046 30.7800 12.4496 22.1084 38.3187 59.3677 94.5592 4.7207 2.2356 26.7631 48.5182 60.5842 119.4484 359.1514 192.0819 6.1731 63.0268 12.7934 35.5475 323.3251 27.0851 85.8075 37.6799 40.7395 155.5950 388.4311 26.6878 89.1231 49.2885 148.5194 75.9318 25.2187 199.2051 430.6715 235.8011 472.4258 466.3240 153.0039 215.0551 56.9782 10.0105 22.0873 33.8357 31.1682 10.3030 6.4411 5.1952 10.9610 3.2205 26.8463 0.8673 20.6687 25.8962 11.6331 32.8450 20.7229 54.8939 43.7216 168.7689 50.0184
temp: 298.150 k
press: 1.00000 atm
elementType: 8 8 8 8 8 8 7 7 7 7 7 7 7 6 6 6 6 6 6 6 6 6 6 6 6 6 6 6 6 6 6 6 6 1 1 1 1 1 1 1 1 1 1 1 1 1 1 1 1 1 1 1 1 1
symmnumber: 1
zpe: 1066864.3 jmol-1
zpe.correction: 0.406347 hartree
zpe.thermalcorrener: 0.436792 hartree
zpe.thermalcorrenthalpy: 0.437736 hartree
zpe.thermalcorrgfe: 0.338674 hartree
zpe.sumelectzpe: -1606.987336 hartree
zpe.sumelectthermal: -1606.956891 hartree
zpe.sumelectthermalent: -1606.955947 hartree
zpe.sumelectthermalfe: -1607.055008 hartree
dipole: -1.3210 7.0439 5.3192
dipole: 8.9250
quadrupole: -208.2704 -160.1848 -199.3345
quadrupole: -48.9259 15.6329 -0.4737
quadrupole: -19.0072 29.0784 -10.0713 -48.9259 15.6329 -0.4737
hfenergy: -1607.3936827 hartree
pointgroup: C01 [X(C20H21N7O6)]
dipole: -0.4988868 -2.6282554 -2.2744507 debye
polarizability: 467.1157622|19.9953308|275.5923165|-15.7190515|20.9225821|217.5085231 unknown
InChI: InChI=1S/C20H21N7O6/c1-27(9-11-8-22-16-15(23-11)18(31)26-20(21)25-16)12-4-2-10(3-5-12)17(30)24-13(19(32)33)6-7-14(28)29/h2-5,8,13,24-25,28,32H,6-7,9,21H2,1H3
charge 0 multiplicity 1
54 atoms
O  7.818617 0.842755 -1.485656
O  4.162571 1.469524 1.967337
O  5.793205 1.025588 -2.60448
O  5.481819 -4.21865 -0.371795
O  6.543911 -3.316784 1.485269
O  -7.498467 0.94553 0.837223
N  -2.034243 2.420879 0.234679
N  4.368445 0.955793 -0.280057
N  -4.870226 0.970884 -0.350637
N  -3.814126 -1.546874 -1.172078
N  -5.816093 -2.579856 -0.47757
N  -7.657674 -1.36737 0.506701
N  -7.802541 -3.673524 0.193335
C  5.813216 0.749457 -0.145953
C  6.185041 -0.616303 0.51066
C  -0.671521 2.126474 0.339791
C  -2.821185 2.164618 -0.98822
C  5.652154 -1.821051 -0.282722
C  2.153234 1.58342 0.602651
C  3.610294 1.338014 0.823058
C  0.034511 2.400513 1.558324
C  0.083864 1.553862 -0.736297
C  -3.620353 0.869754 -0.896285
C  1.404415 2.132244 1.676505
C  1.458293 1.297714 -0.602816
C  6.429187 0.892823 -1.531905
C  -2.7855 2.91419 1.404475
C  5.956587 -3.140575 0.396598
C  -3.101916 -0.395391 -1.298391
C  -5.600461 -0.168746 -0.197125
C  -5.055507 -1.420292 -0.621925
C  -6.982063 -0.1237 0.421261
C  -7.098774 -2.495987 0.083881
H  6.230754 1.537135 0.51272
H  7.282717 -0.672786 0.611206
H  5.760615 -0.609504 1.528419
H  -3.544239 2.989107 -1.118805
H  -2.16107 2.162256 -1.869566
H  6.073892 -1.867333 -1.306144
H  4.55479 -1.748834 -0.410939
H  4.000196 1.000946 -1.233642
H  -0.492443 2.83298 2.412383
H  -0.394502 1.301423 -1.686882
H  1.935156 2.343272 2.611012
H  1.972454 0.842445 -1.45837
H  -3.854518 2.971549 1.14766
H  -2.43734 3.919731 1.712132
H  -2.688044 2.230827 2.269858
H  -2.098945 -0.489611 -1.725618
H  -5.391618 -3.457002 -0.79263
H  8.189273 0.938047 -2.40465
H  5.691919 -5.069741 0.100711
H  -7.445981 -4.5769 -0.107346
H  -8.731479 -3.605045 0.604058
