program: Gaussian 09
title: 000092757
version: EM64L-G09RevD.01
frameworkgroup: C1[X(C2H2BrClF2)]
method: RPBEPBE
basis: SDD
operation: Freq
keyword: #p
keyword: freq=noraman
keyword: PBEPBE/SDD
title: #p freq=noraman PBEPBE/SDD
converged: NO NO NO NO
title: Mulliken charges:
elementType: Br Cl F F C C H H
charge: 0.095578 0.077897 -0.182367 -0.162766 -0.635541 0.220744 0.351988 0.234467
chargesum: 0.00000
title: Mulliken charges with hydrogens summed into heavy atoms:
elementType: Br Cl F F C C
charge: 0.095578 0.077897 -0.182367 -0.162766 -0.283553 0.455211
polarizability: 6.09673570e+01 -1.06192371e+01 4.33941493e+01 3.67717592e+00 3.01155670e+00 3.04658795e+01
1716.lowfreq: -0.0006 0.0034 0.0036 8.2056 11.0315 13.5434 72.8940 161.3736 179.4098
frequency: 72.8783 161.3733 179.4080 220.2562 289.0494 458.0285 584.2670 647.1457 713.5572 920.3482 963.9613 1084.5570 1166.5264 1235.1503 1304.6389 1328.3002 3072.4660 3132.0515
redmass: 13.3915 14.5852 21.9127 18.9352 16.8367 11.2417 8.2762 6.2190 8.0195 3.8005 8.3506 3.8246 1.0836 1.2786 1.2229 1.2528 1.0878 1.0877
irintensity: 1.9297 2.3286 0.2891 1.4739 3.8754 11.4025 76.7566 24.7515 82.3410 44.9348 124.0414 86.6544 11.3022 8.4734 14.6873 17.3533 15.0994 1.2158
temp: 298.150 k
press: 1.00000 atm
elementType: 35 17 9 9 6 6 1 1
symmnumber: 1
zpe: 104876.4 jmol-1
zpe.correction: 0.039945 hartree
zpe.thermalcorrener: 0.046589 hartree
zpe.thermalcorrenthalpy: 0.047534 hartree
zpe.thermalcorrgfe: 0.006931 hartree
zpe.sumelectzpe: -750.119783 hartree
zpe.sumelectthermal: -750.113139 hartree
zpe.sumelectthermalent: -750.112195 hartree
zpe.sumelectthermalfe: -750.152797 hartree
dipole: 1.2843 -1.0286 -2.1729
dipole: 2.7256
quadrupole: -55.1207 -48.4055 -49.7952
quadrupole: -1.0979 0.9758 1.4969
quadrupole: -4.0136 2.7017 1.3119 -1.0979 0.9758 1.4969
hfenergy: -750.1597284 hartree
pointgroup: C01 [X(C2H2Br1Cl1F2)]
dipole: -0.2801759 -0.3793921 0.9630457 debye
dipolederiv: -0.3865424 -0.2787091 0.0369281 -0.2283526 -0.3363062 0.0465527 -0.0166334 -0.0056395 -0.0439665 -0.1331982 -0.0092162 0.0102102 -0.093228 -0.5328793 0.1989872 0.067598 0.2773915 -0.1861933 -0.7943205 -0.2023873 -0.1874072 -0.1806448 -0.3749894 -0.1437726 -0.0783376 -0.0712934 -0.3411471 -0.3417529 0.0522605 0.0760864 0.0464639 -0.2977667 -0.1194289 0.0919675 -0.2174375 -0.6771304 0.4585252 0.4115731 0.0034277 0.5632723 0.9769328 -0.329015 0.0012526 -0.3207196 0.2372149 1.1949159 0.047788 0.1349193 -0.0623707 0.6281482 0.2589208 -0.0905846 0.2965926 1.0242868 0.0021293 -0.057111 -0.0399207 -0.0239839 -0.0159478 0.0144046 -0.0027332 0.0175435 -0.0099194 0.0002436 0.035802 -0.0342438 -0.0211562 -0.0471914 0.0733511 0.0274707 0.0235625 -0.003145 unknown
polarizability: 50.4372974|14.1857953|52.4027227|1.1786601|-6.3462302|31.9873657 unknown
InChI: InChI=1S/C2H2BrClF2/c3-1(4)2(5)6/h1-2H
charge 0 multiplicity 1
8 atoms
Br -2.15346 -0.942008 0.277095
Cl -0.671312 1.768433 -0.573596
F  1.830064 0.292563 0.646322
F  0.879067 -0.858527 -1.098267
C  -0.574746 0.277551 0.514254
C  0.713454 -0.52193 0.271175
H  -0.616609 0.629412 1.553634
H  0.75274 -1.452095 0.866084
