program: Gaussian 09
title: 000092776
version: EM64L-G09RevD.01
frameworkgroup: C1[X(C15H24)]
method: RPBEPBE
basis: SDD
operation: Freq
keyword: #p
keyword: freq=noraman
keyword: PBEPBE/SDD
title: #p freq=noraman PBEPBE/SDD
converged: YES YES NO NO
title: Mulliken charges:
elementType: C C C C C C C C C C C C C C C H H H H H H H H H H H H H H H H H H H H H H H H
charge: -0.033302 -0.089547 -0.444424 -0.499144 -0.754884 -0.225213 -0.466726 -0.418911 0.417121 -0.359489 -0.295514 -0.813609 0.370955 -0.786221 -0.792509 0.210336 0.233062 0.209969 0.189477 0.221159 0.211835 0.208405 0.207813 0.234979 0.222088 0.203733 0.201039 0.218824 0.217611 0.210965 0.224163 0.221376 0.221199 0.226489 0.215065 0.215780 0.220389 0.225614 0.220047
chargesum: 0.00000
title: Mulliken charges with hydrogens summed into heavy atoms:
elementType: C C C C C C C C C C C C C C C
charge: 0.177034 0.143514 -0.044978 -0.066151 -0.103687 -0.003125 -0.061954 -0.200087 0.417121 -0.141879 -0.084549 -0.146869 0.370955 -0.128887 -0.126458
polarizability: 1.72984111e+02 -1.22301330e+01 1.62069977e+02 -6.28970276e+00 -7.74009879e+00 1.43179479e+02
1716.lowfreq: -15.8930 -0.0003 0.0005 0.0006 4.6757 8.9863 15.2626 34.5538 45.8360
frequency: 14.8632 34.3919 45.8038 56.1463 96.3073 128.7009 134.2329 162.9004 167.9701 198.5740 204.6426 225.8827 231.2048 257.4513 288.8297 294.7337 321.5928 336.2997 383.4444 388.8250 432.4332 460.7750 491.0868 509.4768 530.1445 579.3765 597.5207 661.8610 739.2393 764.0592 774.2404 799.3600 811.0562 844.6123 870.7939 914.4089 924.0099 946.0490 951.3919 957.5325 958.5632 975.5576 996.0528 1010.2897 1033.9744 1040.4669 1047.7360 1072.6457 1081.3891 1090.2841 1107.0404 1131.0136 1135.3823 1166.8802 1170.3493 1183.5946 1212.5141 1223.8772 1236.1602 1256.0723 1298.6002 1302.4311 1308.3703 1319.5060 1330.4550 1351.0817 1358.3022 1361.6924 1386.3194 1388.5237 1394.8268 1398.5112 1399.8186 1453.8104 1454.4346 1460.6878 1463.3391 1467.4282 1469.6711 1471.5262 1472.3718 1473.1219 1476.3498 1483.8893 1607.9356 1670.1185 1694.7677 2905.6566 2931.6178 2948.4964 2951.9265 2955.8870 2962.2475 2962.6751 2965.6794 2973.2647 3009.3629 3021.5328 3026.6912 3030.3663 3032.3730 3035.2686 3058.0423 3062.2703 3071.6359 3078.0969 3079.7178 3088.5985 3090.2526 3109.8894 3121.7958
redmass: 3.7005 2.8418 2.9169 3.2285 2.9027 1.0959 2.6694 1.0941 1.4650 2.2816 1.3134 1.9353 1.9597 1.9133 2.4453 2.5008 2.6134 2.5228 2.3830 2.8018 2.4729 2.3611 2.4141 2.8417 2.6648 3.6186 3.0696 2.8893 1.7474 1.9540 2.6499 1.3296 1.7799 1.5773 1.7181 1.9167 2.4100 1.4271 1.6128 1.8550 1.4139 1.6732 1.2484 2.0171 1.7542 1.9098 1.5416 1.7428 1.6649 2.9212 1.5811 2.1382 1.8607 1.2280 1.2865 2.0057 1.6432 1.4176 1.7275 1.3470 1.3076 1.2833 1.3682 1.5660 1.5209 1.5144 1.4771 1.4816 1.2123 1.2996 1.2348 1.2250 1.9232 1.0937 1.0518 1.0717 1.0465 1.0623 1.0649 1.0554 1.0658 1.0621 1.0811 1.0567 7.8067 6.3330 6.5255 1.0785 1.0676 1.0766 1.0705 1.0374 1.0394 1.0373 1.0599 1.0375 1.0988 1.0908 1.0970 1.0964 1.0930 1.0971 1.0906 1.0982 1.0991 1.0975 1.0980 1.0843 1.0959 1.0920 1.0989
irintensity: 0.0026 0.1058 0.0041 0.1022 0.1870 0.3181 0.3070 0.4023 2.6478 0.3886 0.0385 0.7189 1.4479 1.3144 2.2656 0.5446 1.7900 1.4574 0.0967 0.1844 10.9838 4.1763 6.8295 1.8352 1.0340 2.1053 2.0153 4.5295 27.6988 8.5306 1.8210 5.8832 16.4733 14.9974 1.9374 2.7041 4.9072 1.2793 1.4071 5.8093 4.1748 4.3824 3.9436 3.3999 8.6920 2.5183 11.8301 3.4282 5.1393 0.7119 12.9996 10.3152 2.5602 0.8266 0.4392 8.5506 12.5036 1.3389 4.7162 5.8245 3.4478 0.6840 0.2455 2.1620 2.9755 2.0492 1.2350 2.7333 25.2695 22.5763 11.4525 8.9804 3.6241 6.5258 1.3723 5.1732 12.4494 16.6102 7.6373 14.5486 27.1892 12.1747 8.1794 9.8480 1.3376 4.0785 3.1161 20.6804 38.9050 19.1928 25.1603 41.1377 53.1195 58.6993 38.5106 47.3499 29.5419 36.7250 8.9451 54.4634 29.3785 26.2409 23.2327 61.6579 40.3090 45.0344 23.6867 5.2080 41.0308 40.9110 28.3572
temp: 298.150 k
press: 1.00000 atm
elementType: 6 6 6 6 6 6 6 6 6 6 6 6 6 6 6 1 1 1 1 1 1 1 1 1 1 1 1 1 1 1 1 1 1 1 1 1 1 1 1
symmnumber: 1
zpe: 908284.5 jmol-1
zpe.correction: 0.345947 hartree
zpe.thermalcorrener: 0.363594 hartree
zpe.thermalcorrenthalpy: 0.364538 hartree
zpe.thermalcorrgfe: 0.299350 hartree
zpe.sumelectzpe: -584.770314 hartree
zpe.sumelectthermal: -584.752668 hartree
zpe.sumelectthermalent: -584.751723 hartree
zpe.sumelectthermalfe: -584.816911 hartree
dipole: -0.4231 -0.2709 -0.0403
dipole: 0.5040
quadrupole: -93.5978 -92.9089 -91.7320
quadrupole: -1.6794 -1.6850 -1.2047
quadrupole: -0.8516 -0.1627 1.0143 -1.6794 -1.6850 -1.2047
hfenergy: -585.1162612 hartree
pointgroup: C01 [X(C15H24)]
dipole: -0.1671564 0.1046709 0.0204145 debye
polarizability: 172.6749867|11.9118985|163.1066102|7.5831783|-6.1990987|142.45197 unknown
InChI: InChI=1S/C15H24/c1-12(2)6-5-7-14(4)15-10-8-13(3)9-11-15/h6,8-10,14-15H,5,7,11H2,1-4H3
charge 0 multiplicity 1
39 atoms
C  -0.346454 -1.571166 -0.579082
C  0.655738 -0.450006 -0.153258
C  -1.285507 -2.021742 0.571894
C  1.612542 -0.856347 0.999884
C  0.362649 -2.801438 -1.196051
C  1.446841 0.086332 -1.341119
C  -2.151389 -0.898146 1.20992
C  2.730918 0.154814 1.212938
C  3.235464 0.893744 0.176717
C  2.637198 0.731303 -1.168749
C  -3.079252 -0.230297 0.213534
C  4.395139 1.858213 0.3347
C  -3.276364 1.101987 -0.008186
C  -4.26907 1.577971 -1.058454
C  -2.56505 2.218926 0.736417
H  -0.988079 -1.119816 -1.367252
H  0.041169 0.406614 0.211501
H  -0.688625 -2.51254 1.367613
H  -1.964219 -2.804981 0.173737
H  2.071322 -1.846803 0.779976
H  1.037426 -0.987074 1.935946
H  0.960236 -3.347488 -0.441744
H  -0.379344 -3.511326 -1.607273
H  1.04697 -2.507713 -2.012563
H  0.991519 0.009453 -2.338752
H  -1.501517 -0.156371 1.710229
H  -2.759333 -1.361967 2.016234
H  3.184199 0.225408 2.211052
H  3.164547 1.168135 -2.027711
H  -3.668764 -0.935437 -0.396499
H  4.099236 2.889992 0.060952
H  5.237004 1.580851 -0.330204
H  4.771846 1.87556 1.372122
H  -4.763075 0.733094 -1.569283
H  -5.056314 2.212911 -0.604375
H  -3.767542 2.199799 -1.827181
H  -3.296324 2.851079 1.27912
H  -1.828963 1.853088 1.47059
H  -2.036777 2.886883 0.027059
