program: Gaussian 09
title: 000009552
version: EM64L-G09RevD.01
frameworkgroup: C1[X(C8F16)]
method: RPBEPBE
basis: SDD
operation: Freq
keyword: #p
keyword: freq=noraman
keyword: PBEPBE/SDD
title: #p freq=noraman PBEPBE/SDD
converged: YES YES NO NO
title: Mulliken charges:
elementType: F F F F F F F F F F F F F F F F C C C C C C C C
charge: -0.110770 -0.108212 -0.108164 -0.103891 -0.121084 -0.113360 -0.106810 -0.113207 -0.106924 -0.115882 -0.113079 -0.114329 -0.113987 -0.118459 -0.115896 -0.123284 0.052394 0.245018 0.212118 0.206687 0.229325 0.241141 0.253820 0.366836
chargesum: 0.00000
title: Mulliken charges with hydrogens summed into heavy atoms:
polarizability: 9.83391545e+01 -1.09195210e+00 8.87135348e+01 3.14684808e-01 -6.38263106e-01 8.82038017e+01
1716.lowfreq: -4.4295 -0.0011 -0.0011 -0.0009 6.3124 9.5292 34.5289 45.2364 65.0607
frequency: 34.4620 45.2291 65.0529 82.5361 101.3808 106.7477 148.3613 158.2130 162.2164 169.4674 190.3625 207.5764 224.0219 227.8778 234.6623 244.5047 252.8760 269.7286 275.1763 280.5515 284.2709 287.9439 297.9872 302.2278 306.4540 325.8929 337.7456 350.6430 357.5809 401.7477 415.2645 442.7661 467.8850 506.7950 526.8490 531.2154 546.9829 565.3291 571.1789 578.3103 616.2114 643.7741 730.0472 780.8905 881.2428 923.5205 964.3995 969.4830 1012.3080 1019.6794 1022.0750 1030.9735 1037.5201 1046.0513 1060.2084 1068.8489 1083.4303 1092.9551 1105.3886 1112.3944 1134.1743 1137.0307 1178.5932 1182.8540 1198.7337 1200.7073
redmass: 18.5367 18.4105 18.6830 18.6784 18.2586 18.4758 17.9671 18.1142 18.0238 17.9955 17.8897 18.4669 18.7904 18.7912 18.3285 18.7975 18.6797 18.5159 18.4778 18.5826 18.4192 18.8316 18.2593 18.5983 18.2012 18.7200 17.1714 18.2624 17.5719 17.7033 17.4651 17.3103 17.6998 17.4880 17.5627 16.9469 16.9851 17.3974 16.7809 17.4872 18.0158 16.8257 14.3422 12.9853 13.7671 13.5892 13.5985 13.4832 13.3036 13.3619 13.2972 13.0913 13.0114 13.1632 13.1791 12.9243 13.4096 12.4086 12.6311 12.3070 12.5475 12.4993 12.6363 12.2310 12.2941 12.1024
irintensity: 0.0204 0.0361 0.0382 0.1426 0.1456 0.1786 1.4251 1.9937 1.2622 0.4390 0.0187 1.8270 0.4447 0.9808 3.0676 0.4417 1.1745 1.3185 2.9933 2.7925 3.3221 0.9389 0.1581 0.5814 0.8082 0.2343 0.0875 5.3507 0.9129 3.9605 13.6845 34.0004 1.3902 1.1518 2.5968 0.5306 22.7056 17.7872 10.9913 12.4848 2.7032 46.9334 66.0734 29.8040 168.2802 53.5378 50.8844 67.4372 9.9479 2.6035 4.1993 12.1612 38.9793 19.8342 178.9011 39.7253 514.2198 109.0948 103.5649 38.8110 68.5105 152.2639 27.4868 10.1949 15.1470 15.4262
temp: 298.150 k
press: 1.00000 atm
elementType: 9 9 9 9 9 9 9 9 9 9 9 9 9 9 9 9 6 6 6 6 6 6 6 6
symmnumber: 1
zpe: 228005.7 jmol-1
zpe.correction: 0.086843 hartree
zpe.thermalcorrener: 0.109139 hartree
zpe.thermalcorrenthalpy: 0.110083 hartree
zpe.thermalcorrgfe: 0.036791 hartree
zpe.sumelectzpe: -1900.412963 hartree
zpe.sumelectthermal: -1900.390668 hartree
zpe.sumelectthermalent: -1900.389723 hartree
zpe.sumelectthermalfe: -1900.463016 hartree
dipole: 0.0366 -0.1239 0.0405
dipole: 0.1354
quadrupole: -136.6738 -136.6547 -136.6055
quadrupole: 0.2193 0.1326 -0.0274
quadrupole: -0.0292 -0.0100 0.0391 0.2193 0.1326 -0.0274
hfenergy: -1900.4998062 hartree
pointgroup: C01 [X(C8F16)]
dipole: 0.0141624 -0.0490962 0.014999 debye
dipolederiv: -0.269374 0.0063711 -0.0040996 0.0061965 -0.2161106 0.0005889 0.0105078 -0.0149029 -0.450382 -0.2863143 -0.0094243 0.0021918 -0.0126961 -0.2626817 -0.0868041 -0.0099655 0.0036357 -0.5708056 -0.3169839 0.0694822 -0.0386692 0.0791754 -0.6260729 0.1684517 -0.0279947 0.1129657 -0.2734549 -0.2871246 0.0193954 0.0551011 0.0149093 -0.2603392 0.0681656 0.0004964 -0.0070264 -0.5624626 -0.4840165 -0.1552463 -0.1129293 -0.1639894 -0.4981665 -0.1386881 -0.0814624 -0.0961517 -0.2747782 -0.4937384 -0.2011888 -0.1208209 -0.2089476 -0.4905388 -0.1345916 -0.0804073 -0.0856608 -0.2900826 -0.279155 -0.0041258 0.0657207 -0.0006034 -0.2606635 0.0627632 0.0060748 -0.0144651 -0.5904779 -0.3337291 0.1164826 -0.0568533 0.1296286 -0.6255297 0.1878603 -0.0427032 0.127183 -0.3020764 -0.2789486 0.0089914 0.0312431 0.0063243 -0.2661125 -0.0982205 0.0113619 -0.0022462 -0.5804929 -0.6809332 0.0934169 0.1816838 0.0942723 -0.2909536 -0.0424784 0.121657 -0.0275311 -0.2939484 -0.2804861 0.0019702 -0.087567 0.0041541 -0.259268 0.0135793 0.0096361 -0.0103767 -0.5929902 -0.3767069 0.1104918 -0.0553261 0.1017048 -0.5349396 0.1954385 -0.0353708 0.1186038 -0.3071049 -0.3170782 0.0017775 0.040784 -0.002816 -0.2421147 -0.1069057 0.0200004 -0.0205136 -0.5949163 -0.3500257 -0.0386186 -0.0415207 -0.0101251 -0.3150601 -0.1731027 0.0503345 -0.1363703 -0.6649638 -0.787252 0.2125744 0.0690289 0.1347489 -0.3858192 -0.0414307 0.0344759 -0.0441912 -0.2566372 -0.3644618 -0.0516446 0.0111317 0.0179172 -0.5636543 0.244471 -0.0552943 0.2136824 -0.4283331 0.0732233 0.044928 -0.0129265 -0.0839609 0.0617728 0.0122734 0.0448265 -0.0234353 0.404543 0.6476358 -0.07383 0.0295552 0.0959086 0.9649793 -0.1253023 0.0967311 -0.0224851 0.8554586 0.7641456 0.1710791 0.0728156 0.0792399 0.8475362 0.1128752 0.0762002 0.0053234 0.8480663 0.7790932 0.2166243 0.0876199 0.1845078 0.7464292 0.1058195 -0.0063432 0.0388766 0.8864676 0.6265313 -0.1377286 0.0372098 -0.1336736 0.8963298 -0.1355517 -0.0078189 -0.0457818 0.8861305 0.9799493 -0.102801 -0.1405851 -0.1015194 0.5334505 0.0429411 -0.0440125 0.022631 0.8859863 0.797561 -0.1361482 0.0471581 -0.2067604 0.7503895 -0.0908711 -0.1153974 -0.0719933 0.9072886 1.5181887 -0.1628288 -0.059946 -0.023596 1.2971378 -0.0412807 0.0244673 -0.0197701 1.3599662 unknown
polarizability: 98.3278217|-1.1625955|88.7499005|0.2304315|-0.6239586|88.1787687 unknown
InChI: InChI=1S/C8F16/c9-1(4(14,15)8(22,23)24)2(10,11)5(16,17)7(20,21)6(18,19)3(1,12)13
charge 0 multiplicity 1
24 atoms
F  -0.526065 0.290472 -1.687045
F  0.548522 1.555974 1.580724
F  0.218526 2.636213 -0.402281
F  -0.14613 -1.245916 1.603116
F  -0.834248 -2.1102 -0.399631
F  2.886393 2.027621 0.313103
F  2.146313 1.160597 -1.659503
F  1.827346 -2.678943 0.428521
F  1.530862 -1.672735 -1.594701
F  3.744738 -0.653295 -0.382836
F  2.656151 -0.366696 1.600652
F  -2.311717 1.881918 -0.440868
F  -2.00635 0.90894 1.604109
F  -3.123053 -0.794256 -1.41449
F  -4.370132 0.342824 0.095239
F  -3.13641 -1.422082 0.777564
C  -0.506125 0.297309 -0.249333
C  0.553314 1.399715 0.173119
C  -0.017803 -1.129643 0.198394
C  2.034704 1.065035 -0.255168
C  1.469244 -1.473435 -0.197989
C  2.499272 -0.36135 0.195202
C  -1.977314 0.672969 0.21219
C  -3.160238 -0.331238 -0.098188
