program: Gaussian 09
title: 000092749
version: EM64L-G09RevD.01
frameworkgroup: C1[X(C10H13NO3)]
method: RPBEPBE
basis: SDD
operation: Freq
keyword: #p
keyword: freq=noraman
keyword: PBEPBE/SDD
title: #p freq=noraman PBEPBE/SDD
converged: YES YES NO NO
title: Mulliken charges:
elementType: O O O N C C C C C C C C C C H H H H H H H H H H H H H
charge: -0.402380 -0.253377 -0.438974 -0.572501 0.187354 -0.609182 0.529387 -0.714093 0.138954 -0.517177 -0.437087 0.295162 -0.201291 -0.410206 0.240652 0.230604 0.215894 0.252895 0.220653 0.284259 0.272504 0.279362 0.235970 0.223475 0.219824 0.376545 0.352776
chargesum: 0.00000
title: Mulliken charges with hydrogens summed into heavy atoms:
elementType: O O O N C C C C C C C C C C
charge: -0.025836 -0.253377 -0.086198 -0.015738 0.187354 -0.137926 0.529387 -0.024651 0.138954 -0.237815 -0.201117 0.295162 0.022184 -0.190382
polarizability: 1.47334868e+02 9.77771469e+00 1.28221327e+02 1.65240111e+01 -6.30477535e+00 9.06320183e+01
1716.lowfreq: -14.7034 -1.2503 0.0007 0.0008 0.0010 2.5880 23.3565 33.5961 64.0483
frequency: 23.2876 33.2113 64.0364 86.2699 172.0126 221.3132 222.2811 232.6689 248.5085 281.3047 308.7186 334.7951 356.0997 357.2383 393.9744 429.8574 443.1863 473.5785 517.4546 540.7712 563.4822 600.9705 638.8622 666.6009 684.1007 695.3064 737.5077 751.9028 786.1216 857.9793 881.3409 900.2140 924.8498 936.8123 962.1741 970.8240 984.8203 1027.4825 1033.8649 1083.5027 1116.3300 1143.5233 1168.9482 1174.7451 1181.7014 1221.2833 1262.5727 1272.3627 1308.0079 1316.2535 1341.5192 1393.0339 1393.4323 1461.1237 1466.2014 1469.1536 1475.8708 1479.0791 1592.7233 1626.2772 1627.5285 1637.5695 2997.7274 3001.7569 3069.3603 3090.1854 3113.4451 3119.9235 3130.6492 3150.8391 3156.6376 3431.0495 3484.8915 3560.8030 3581.5782
redmass: 5.1807 7.7325 7.3040 3.7895 5.7786 1.4998 4.4186 3.2504 1.8169 2.5297 2.1792 1.6243 2.8907 1.1243 2.7464 2.6702 3.6245 3.6136 7.1625 3.8357 3.7915 2.2725 1.7885 1.5010 3.7548 2.2490 4.7676 2.9619 1.9379 1.8402 1.6232 1.5747 2.2005 2.3489 1.3355 1.8431 6.1580 1.6898 2.4153 1.6823 1.4196 1.4193 2.3560 1.2185 1.4215 1.5521 1.9995 2.8515 1.7217 1.4881 1.8518 1.8264 2.3685 1.1182 2.0883 1.1193 1.1417 2.4466 6.3916 8.8022 6.2578 1.0966 1.0383 1.0587 1.1021 1.0996 1.0882 1.0994 1.0898 1.0932 1.0983 1.0446 1.0637 1.0975 1.0660
irintensity: 0.4536 3.0172 0.6881 1.6620 0.8066 6.5050 2.5702 0.4887 2.8351 11.7428 7.5376 29.5930 19.2385 142.8972 3.7322 5.5314 1.1168 26.4519 1.7411 5.2734 0.4477 86.8796 87.4745 207.7202 14.0287 50.4126 9.8206 23.5570 47.5734 2.3892 0.1987 14.7379 18.6519 34.7557 0.5342 11.1982 2.1647 68.2569 170.8632 6.8177 18.0339 137.1119 12.9882 4.8410 38.3353 20.7747 46.0141 11.1668 16.4404 13.6104 5.8277 10.5283 23.2355 4.7054 15.6899 15.6471 21.3532 31.9495 65.3788 161.3502 57.1070 48.6580 22.5331 16.0918 7.9921 29.4846 10.8366 16.5459 15.4226 7.4828 14.5303 1.4459 14.7441 2.3419 32.4742
temp: 298.150 k
press: 1.00000 atm
elementType: 8 8 8 7 6 6 6 6 6 6 6 6 6 6 1 1 1 1 1 1 1 1 1 1 1 1 1
symmnumber: 1
zpe: 564920.8 jmol-1
zpe.correction: 0.215167 hartree
zpe.thermalcorrener: 0.229276 hartree
zpe.thermalcorrenthalpy: 0.230220 hartree
zpe.thermalcorrgfe: 0.173566 hartree
zpe.sumelectzpe: -668.235063 hartree
zpe.sumelectthermal: -668.220954 hartree
zpe.sumelectthermalent: -668.220010 hartree
zpe.sumelectthermalfe: -668.276664 hartree
dipole: 0.8731 -0.8519 2.0886
dipole: 2.4188
quadrupole: -64.9306 -83.8950 -84.5911
quadrupole: -0.1960 2.2218 3.7968
quadrupole: 12.8750 -6.0894 -6.7856 -0.1960 2.2218 3.7968
hfenergy: -668.4502301 hartree
pointgroup: C01 [X(C10H13N1O3)]
dipole: 0.3580424 -0.3289399 0.8180277 debye
polarizability: 146.2096453|10.4678828|129.4093791|17.1116993|-4.880011|90.5691886 unknown
InChI: InChI=1S/C10H13NO3/c1-10(11,9(13)14)6-7-3-2-4-8(12)5-7/h2-5,12-13H,6,11H2,1H3
charge 0 multiplicity 1
27 atoms
O  -1.731124 1.143075 1.700063
O  -2.036861 1.889357 -0.469294
O  2.999243 2.049027 -0.115121
N  -3.322175 -0.765729 -0.791614
C  -2.038614 -0.561315 -0.07656
C  -0.88931 -0.844456 -1.110047
C  0.525195 -0.674784 -0.576871
C  -1.981843 -1.519713 1.125456
C  -1.929121 0.930564 0.333922
C  1.146207 0.597448 -0.58172
C  1.245593 -1.790414 -0.070692
C  2.456155 0.750416 -0.076462
C  2.556414 -1.629746 0.427362
C  3.173298 -0.358921 0.431775
H  -1.057178 -1.879006 -1.458794
H  -1.052324 -0.167687 -1.970516
H  -2.803572 -1.315637 1.835047
H  -1.033175 -1.415539 1.673493
H  -2.080945 -2.555779 0.757862
H  -3.457677 -0.108276 -1.569617
H  -4.136492 -0.794324 -0.167056
H  0.629822 1.47653 -0.981864
H  0.77989 -2.782411 -0.077314
H  3.106854 -2.496254 0.810126
H  4.194375 -0.236906 0.816489
H  -1.666637 2.123782 1.868925
H  3.9222 2.053297 0.241221
