program: Gaussian 09
title: 000092972
version: EM64L-G09RevD.01
frameworkgroup: C1[X(C16H22O11)]
method: RPBEPBE
basis: SDD
operation: Freq
keyword: #p
keyword: freq=noraman
keyword: PBEPBE/SDD
title: #p freq=noraman PBEPBE/SDD
converged: YES YES NO NO
title: Mulliken charges:
elementType: O O O O O O O O O O O C C C C C C C C C C C C C C C C H H H H H H H H H H H H H H H H H H H H H H
charge: -0.295379 -0.272684 -0.279911 -0.283533 -0.262712 -0.195969 -0.235616 -0.251188 -0.238603 -0.233832 -0.234233 0.055111 -0.187834 -0.098075 -0.093395 -0.437027 -0.052346 0.343657 0.343222 0.322715 0.326211 -0.780053 0.311987 -0.771798 -0.764246 -0.756049 -0.757070 0.292521 0.302968 0.315323 0.282408 0.257859 0.302519 0.209802 0.267555 0.246971 0.267874 0.259881 0.253511 0.249747 0.247892 0.255241 0.247130 0.247856 0.246488 0.266365 0.262329 0.248416 0.247994
chargesum: 0.00000
title: Mulliken charges with hydrogens summed into heavy atoms:
elementType: O O O O O O O O O O O C C C C C C C C C C C C C C C C
charge: -0.295379 -0.272684 -0.279911 -0.283533 -0.262712 -0.195969 -0.235616 -0.251188 -0.238603 -0.233832 -0.234233 0.347632 0.115134 0.217248 0.189013 0.123352 0.157456 0.343657 0.343222 0.322715 0.326211 0.002347 0.311987 -0.008660 -0.013983 0.004659 0.001670
polarizability: 2.06638429e+02 1.83301861e+01 2.19404946e+02 1.39275098e+00 5.91095993e+00 1.92398507e+02
1716.lowfreq: -2.2620 -0.0003 0.0000 0.0008 2.6389 8.0628 19.4911 23.4883 30.0589
frequency: 19.4257 23.4308 30.0157 35.8714 40.6839 47.0736 48.5480 53.2506 58.1134 63.1328 67.3741 71.6154 74.5845 76.5386 81.9764 84.8620 88.9246 104.3161 117.4664 122.4219 128.0348 145.2455 160.4694 182.8603 194.9197 202.5954 217.5742 235.1926 249.6980 269.6362 281.4158 288.6955 303.5613 311.9715 384.8617 387.3109 405.5399 441.5850 469.0980 488.2748 511.0099 549.0257 555.9512 560.2150 561.8125 567.1615 579.9635 599.8251 607.6331 620.5547 636.6153 639.2916 678.1726 710.3104 760.9259 776.9590 785.6672 825.3442 863.2586 868.3703 898.6759 908.7417 954.7067 959.3283 977.0218 984.7578 990.5816 992.5973 1000.8701 1001.6292 1003.2540 1030.8679 1041.2287 1042.4314 1043.3705 1044.8387 1044.9740 1049.9879 1107.7296 1120.9809 1149.6383 1179.1997 1180.9506 1183.5267 1191.9470 1205.4470 1234.8291 1250.9742 1260.3544 1302.7288 1308.4710 1328.4657 1338.9115 1365.0554 1371.3908 1372.6885 1379.5248 1381.9601 1384.8039 1385.7959 1386.5028 1387.8234 1449.8789 1451.9643 1452.9086 1453.2827 1453.5028 1454.2132 1455.1437 1456.3059 1458.3148 1460.8800 1476.1364 1637.6170 1656.5235 1660.8269 1667.3278 1668.8838 1674.4446 2956.7358 2983.8531 3003.7123 3004.6433 3005.8355 3008.8173 3009.5696 3019.0284 3036.5875 3043.6099 3046.0518 3095.6072 3096.8428 3100.3828 3101.2264 3102.4961 3127.9482 3141.1243 3142.1800 3142.3929 3142.9766 3144.2271
redmass: 5.8476 4.7647 6.2758 4.5926 4.9818 3.5741 2.0896 2.5554 1.8690 2.3075 3.8864 3.3719 2.8120 5.0111 1.0833 5.0481 3.3568 4.6694 4.0834 1.2694 1.0666 7.2419 5.2738 7.0419 6.5255 5.2195 6.3733 5.2588 3.8558 6.3455 7.5278 4.9985 6.4985 2.9098 3.5600 3.3642 3.4387 4.3768 3.9331 3.8477 3.9151 3.2703 3.2425 3.3462 3.3752 3.4105 4.9000 5.7678 4.9916 4.1999 5.3062 4.0687 4.7091 3.8824 4.3928 3.4118 4.8875 4.6738 4.8101 6.4887 6.8231 4.2176 3.1376 4.0576 2.4700 2.2288 2.0049 2.0461 2.2270 1.9395 2.7524 3.8626 2.3456 1.6544 2.3396 1.6907 1.6492 1.6721 2.2006 3.4787 2.2671 3.0003 2.8411 3.3291 3.3378 3.5245 1.2809 1.4682 1.2543 1.2229 1.3811 1.3401 1.3591 1.4016 1.2929 1.2254 1.2941 1.2781 1.2443 1.2521 1.2597 1.2815 1.0566 1.0566 1.0560 1.0569 1.0519 1.0552 1.0524 1.0498 1.0542 1.0522 1.0900 8.6971 9.9302 9.7290 9.5772 9.6580 9.8726 1.0878 1.0814 1.0381 1.0368 1.0388 1.0380 1.0375 1.0814 1.0842 1.0841 1.0599 1.0977 1.0953 1.0938 1.0956 1.0941 1.1082 1.1015 1.1026 1.1007 1.1023 1.1019
irintensity: 0.1974 0.1637 0.2340 1.7953 0.2559 1.6080 2.2959 3.3381 1.9849 2.1683 1.6353 1.3507 6.1398 0.1072 1.1428 1.0444 6.4635 2.9112 0.2589 0.4481 0.3683 1.6148 6.2277 4.4632 7.3302 13.0766 9.1259 12.4248 6.6600 3.6556 6.1685 2.4584 15.7174 9.3270 4.5865 12.8046 12.5586 26.1317 9.7712 17.7379 10.4034 2.2390 2.0279 5.8325 10.3248 5.5089 0.1765 6.3412 9.0410 6.1291 18.4212 30.6056 4.3593 12.2464 15.8840 23.1200 22.5662 8.2388 56.9449 55.9181 44.8859 61.7519 62.5619 48.2993 14.7935 4.4195 12.8462 81.5992 98.4047 30.6689 224.9164 34.6268 46.5050 16.6978 40.1767 1.7779 10.6460 25.3055 12.8483 6.2960 3.9644 393.2772 243.9992 441.8355 287.8858 110.2200 16.7688 31.2163 15.1452 18.1076 7.7714 1.8359 12.5259 4.3358 6.9835 14.2041 38.9906 7.2047 17.5829 124.5507 64.3810 42.2673 30.5338 30.9699 6.5789 7.3034 32.4927 20.2131 15.7296 15.5767 34.0411 3.1854 19.2186 102.2946 208.6718 81.6971 293.2865 101.7587 169.1672 44.2850 20.9312 2.9913 0.5890 0.8480 1.5268 0.7208 6.3229 4.8860 7.2355 5.7911 1.4248 8.8656 7.6444 5.7381 6.6127 2.7150 8.3701 7.0997 6.0224 8.6060 9.3421
temp: 298.150 k
press: 1.00000 atm
elementType: 8 8 8 8 8 8 8 8 8 8 8 6 6 6 6 6 6 6 6 6 6 6 6 6 6 6 6 1 1 1 1 1 1 1 1 1 1 1 1 1 1 1 1 1 1 1 1 1 1
symmnumber: 1
zpe: 971904.8 jmol-1
zpe.correction: 0.370179 hartree
zpe.thermalcorrener: 0.401965 hartree
zpe.thermalcorrenthalpy: 0.402909 hartree
zpe.thermalcorrgfe: 0.301787 hartree
zpe.sumelectzpe: -1448.291604 hartree
zpe.sumelectthermal: -1448.259818 hartree
zpe.sumelectthermalent: -1448.258873 hartree
zpe.sumelectthermalfe: -1448.359996 hartree
dipole: -1.0540 -2.4351 -1.3869
dipole: 2.9940
quadrupole: -173.3970 -135.8207 -164.8490
quadrupole: 27.4463 1.3785 -4.6773
quadrupole: -15.3747 22.2015 -6.8268 27.4463 1.3785 -4.6773
hfenergy: -1448.6617828 hartree
pointgroup: C01 [X(C16H22O11)]
dipole: -0.4824034 0.5428372 0.9274415 debye
polarizability: 214.4369318|-11.7866273|200.1569572|-15.030918|11.6445348|203.8479937 unknown
InChI: InChI=1S/C16H22O11/c1-8(18)23-7-14(25-10(3)20)16(27-12(5)22)15(26-11(4)21)13(6-17)24-9(2)19/h6,13-16H,7H2,1-5H3
charge 0 multiplicity 1
49 atoms
O  -0.598584 0.754928 -1.224876
O  -0.266561 1.67835 1.57065
O  -2.355941 -0.265311 0.938651
O  2.649929 0.705451 -0.465847
O  0.245042 -2.932195 0.787044
O  1.683432 2.909039 -1.868901
O  -0.217799 -0.94874 -2.774204
O  -0.222336 0.339793 3.485531
O  -3.499905 -0.204033 -1.105439
O  4.397182 2.162825 0.061667
O  -1.36142 -4.425874 -0.018578
C  -0.103249 -0.152743 -0.161375
C  0.62831 0.716033 0.868685
C  -1.258741 -1.056253 0.314625
C  1.711991 1.605797 0.21899
C  -0.841894 -2.09967 1.367012
C  1.153702 2.649305 -0.766346
C  -0.621412 0.207193 -2.535442
C  -0.627753 1.363735 2.894966
C  -3.42886 0.104727 0.10133
C  3.992113 1.155685 -0.550848
C  -1.192472 1.204757 -3.505049
C  -0.165769 -4.077509 0.06787
C  -1.559788 2.410597 3.451838
C  -4.434734 0.922697 0.87903
C  4.782439 0.250155 -1.459912
C  1.027124 -4.752873 -0.564108
H  0.658391 -0.824654 -0.605138
H  1.100358 0.057197 1.620332
H  -1.66711 -1.567573 -0.576916
H  2.245102 2.16352 1.018277
H  -1.708555 -2.735086 1.615132
H  -0.417783 -1.643749 2.273468
H  0.271154 3.204606 -0.376309
H  -0.686709 2.179281 -3.395624
H  -1.078116 0.832501 -4.533083
H  -2.265284 1.344948 -3.281738
H  -2.597787 2.134769 3.19072
H  -1.475975 2.436987 4.54857
H  -1.350139 3.402399 3.022951
H  -4.586835 0.504028 1.886956
H  -5.387751 0.953476 0.331231
H  -4.056826 1.955827 0.98905
H  4.504248 -0.804484 -1.304321
H  5.858769 0.395939 -1.288677
H  4.547469 0.505569 -2.508997
H  1.252751 -4.254778 -1.525304
H  0.793168 -5.808636 -0.765825
H  1.916314 -4.668553 0.07978
