program: Gaussian 09
title: 000092743
version: EM64L-G09RevD.01
frameworkgroup: C1[X(C9H12N2O4)]
method: RPBEPBE
basis: SDD
operation: Freq
keyword: #p
keyword: freq=noraman
keyword: PBEPBE/SDD
title: #p freq=noraman PBEPBE/SDD
converged: YES YES NO NO
title: Mulliken charges:
elementType: O O O O N N C C C C C C C C C H H H H H H H H H H H H
charge: -0.447605 -0.442568 -0.207096 -0.205960 -0.588801 0.028101 -0.269618 -0.194233 0.463071 -0.299773 -0.415439 -0.350447 -0.352059 -0.356154 0.376363 0.204902 0.268026 0.162178 0.227738 0.247265 0.277660 0.312983 0.271538 0.288491 0.288096 0.350643 0.362697
chargesum: 0.00000
title: Mulliken charges with hydrogens summed into heavy atoms:
elementType: O O O O N N C C C C C C C C C
charge: -0.096963 -0.079871 -0.207096 -0.205960 -0.004279 0.028101 -0.064715 0.073793 0.463071 0.090143 -0.168174 -0.072787 -0.063569 -0.068058 0.376363
polarizability: 2.10879661e+02 -1.51466121e+01 9.83514757e+01 6.21689856e+00 1.84000228e+01 1.09084662e+02
1716.lowfreq: -12.7064 -0.0009 -0.0007 -0.0007 4.3124 5.6933 31.4009 42.5773 64.1301
frequency: 31.3420 42.5748 64.0894 69.7729 107.0913 129.9274 152.6183 214.0973 239.5358 279.1283 288.6070 308.1327 323.8440 334.8203 407.4498 409.6681 423.4635 449.2389 503.3414 531.3560 577.2225 625.2401 649.3154 662.4161 671.5460 743.2693 772.9879 779.8468 835.7955 852.3981 862.6451 884.9112 950.4218 983.1980 988.6585 998.2301 1004.1859 1010.3848 1029.9637 1092.0928 1108.2635 1123.5388 1142.2259 1174.2557 1178.2642 1202.9151 1219.8414 1247.2860 1275.9882 1280.9505 1304.6453 1313.1595 1331.2317 1367.0044 1376.1781 1402.4551 1405.0684 1419.6068 1477.7294 1481.1662 1595.5309 1606.1186 1648.8899 2896.1781 2938.2077 3026.8840 3073.0176 3135.1404 3153.9097 3182.3899 3184.6580 3352.9124 3426.9985 3557.8400 3562.6704
redmass: 6.0592 7.4838 3.4453 5.4999 4.0761 5.1292 7.4112 4.8704 6.5281 3.8942 2.6050 1.3736 4.7973 1.1256 4.1258 2.8884 3.0485 5.6079 6.4411 4.1209 2.8802 6.7777 1.2022 5.0216 4.5612 4.4185 3.7392 1.9467 4.4960 1.3629 1.5597 2.0498 2.9251 2.1782 1.3874 1.4182 3.0879 3.6473 2.7405 3.3035 1.3727 1.9851 1.3871 1.1922 1.2817 2.4341 5.9595 1.4030 1.4446 1.3904 1.2428 1.3996 1.3770 6.7132 1.2817 1.2754 5.9841 3.2478 2.4383 1.0902 7.6865 6.2389 1.0904 1.0716 1.0832 1.0849 1.0911 1.0904 1.0899 1.0946 1.0956 1.0640 1.0476 1.0937 1.0663
irintensity: 1.5647 2.4821 0.2574 0.1601 12.5777 3.0900 3.6726 4.6935 1.2819 8.9370 10.2081 9.8359 7.4421 146.4983 9.0204 2.9617 7.6548 2.5187 3.3395 10.7505 39.8685 2.2600 133.8487 10.3092 25.7137 11.7622 32.0175 362.0109 16.2213 12.0043 34.4447 5.2271 54.0931 78.2471 0.2270 0.6531 40.6132 74.0374 47.4260 16.2610 13.2598 27.3439 17.2172 46.9191 53.8529 6.3388 333.0290 17.0652 30.7667 0.8298 40.0661 4.7789 1.6356 88.3685 1.8612 69.0769 4.4253 57.6661 4.2241 1.6561 1.3701 66.7370 50.2480 69.0797 53.8535 16.9629 34.8909 8.7515 1.4176 0.0586 3.1465 40.3079 8.8234 10.1458 8.7993
temp: 298.150 k
press: 1.00000 atm
elementType: 8 8 8 8 7 7 6 6 6 6 6 6 6 6 6 1 1 1 1 1 1 1 1 1 1 1 1
symmnumber: 1
zpe: 547040.0 jmol-1
zpe.correction: 0.208357 hartree
zpe.thermalcorrener: 0.223014 hartree
zpe.thermalcorrenthalpy: 0.223958 hartree
zpe.thermalcorrgfe: 0.165457 hartree
zpe.sumelectzpe: -759.319348 hartree
zpe.sumelectthermal: -759.304690 hartree
zpe.sumelectthermalent: -759.303746 hartree
zpe.sumelectthermalfe: -759.362247 hartree
dipole: 4.0861 -4.0329 3.3303
dipole: 6.6371
quadrupole: -114.7643 -93.7151 -83.7863
quadrupole: -6.9050 5.4167 3.6249
quadrupole: -17.3424 3.7068 13.6356 -6.9050 5.4167 3.6249
hfenergy: -759.5277041 hartree
pointgroup: C01 [X(C9H12N2O4)]
dipole: 1.6184335 1.9954117 -0.4664515 debye
polarizability: 211.0895477|15.5603069|85.5621167|0.9270025|6.6396256|121.6641347 unknown
InChI: InChI=1S/C9H12N2O4/c10-8(5-12)9(13)6-1-3-7(4-2-6)11(14)15/h1-4,8-9,12-13H,5,10H2
charge 0 multiplicity 1
27 atoms
O  2.24738 2.087463 0.724011
O  3.611226 -2.454866 -0.223449
O  -4.377809 -0.591762 -1.024343
O  -4.305535 -0.398277 1.248098
N  4.241946 0.149982 0.274995
N  -3.753553 -0.353828 0.081259
C  1.894611 0.993114 -0.20366
C  2.803377 -0.191753 0.242737
C  0.412585 0.660378 -0.138606
C  2.649699 -1.44773 -0.650534
C  -0.324082 0.390329 -1.320753
C  -0.243888 0.59318 1.120111
C  -1.690073 0.05353 -1.259373
C  -1.607833 0.258509 1.201662
C  -2.31276 -0.007154 0.006046
H  2.165352 1.274931 -1.246495
H  2.516413 -0.462021 1.276857
H  2.81278 -1.169793 -1.719811
H  1.644173 -1.889065 -0.555286
H  0.173342 0.4479 -2.296025
H  0.323647 0.816922 2.029139
H  4.475587 0.800965 1.032479
H  4.593086 0.504572 -0.625495
H  -2.276729 -0.156065 -2.157481
H  -2.133571 0.199682 2.158329
H  1.686386 2.878911 0.522105
H  4.400241 -1.922252 0.094584
