program: Gaussian 09
title: 000092747
version: EM64L-G09RevD.01
frameworkgroup: C1[X(C21H32O2)]
method: RPBEPBE
basis: SDD
operation: Freq
keyword: #pfreq=noraman
keyword: PBEPBE/SDD
title: #p freq=noraman PBEPBE/SDD
converged: YES YES NO NO
title: Mulliken charges:
elementType: O O C C C C C C C C C C C C C C C C C C C C C H H H H H H H H H H H H H H H H H H H H H H H H H H H H H H H H
charge: -0.436604 -0.238069 0.452663 -0.116990 -0.155461 -0.096990 -0.139570 -0.561684 0.232913 -0.563644 -0.535042 -0.492024 -0.481986 -0.869246 0.540167 -0.641363 -0.159625 -0.493362 -0.811778 -0.563310 -0.587740 -0.733294 0.178298 0.211450 0.229108 0.199196 0.215949 0.187508 0.243408 0.211523 0.231426 0.218855 0.222104 0.212720 0.217915 0.226054 0.216120 0.222601 0.254650 0.221732 0.221454 0.234107 0.231994 0.217353 0.215961 0.220816 0.229072 0.233123 0.244328 0.230881 0.254550 0.240047 0.232503 0.200856 0.324378
chargesum: 0.00000
title: Mulliken charges with hydrogens summed into heavy atoms:
elementType: O O C C C C C C C C C C C C C C C C C C C C C
charge: -0.112226 -0.238069 0.452663 0.094460 0.073648 0.102206 0.076378 -0.130768 0.232913 -0.120696 -0.094083 -0.061390 -0.039812 -0.170263 0.540167 -0.185802 0.072369 -0.060047 -0.128767 -0.088102 -0.333190 -0.059888 0.178298
polarizability: 2.95811148e+02 -8.66244584e+00 2.06735334e+02 -1.30033200e+01 7.04213911e-01 1.75238407e+02
1716.lowfreq: -13.2760 -8.0031 -0.0007 -0.0006 -0.0005 7.8204 32.0810 41.9741 59.4017
frequency: 31.7282 41.8961 59.3426 76.0581 96.5520 121.1667 152.5563 164.3169 172.5020 191.4324 194.5455 209.5471 225.9325 230.3927 241.8572 260.5766 264.8205 271.4019 283.3793 290.5104 296.2112 317.4740 340.9060 356.0793 370.1824 384.0812 413.5843 424.2894 432.6413 452.6802 456.8674 483.1467 498.1709 528.3483 530.8619 553.9789 563.5154 609.2807 634.3787 646.2471 676.6003 715.4576 736.8882 775.4732 805.8180 817.7908 830.4893 837.3281 847.0246 861.9851 882.9341 901.6857 913.3548 921.2670 934.3891 946.5257 951.6932 961.4968 970.0022 991.0209 1000.1330 1012.8074 1022.9196 1023.9542 1028.5886 1030.7608 1047.7812 1070.9718 1072.8026 1085.9888 1087.6876 1110.2198 1113.9423 1121.9713 1125.8966 1132.8580 1157.9930 1161.8998 1175.0098 1187.1368 1188.2827 1197.5837 1203.4875 1211.6574 1228.7510 1234.1229 1238.4026 1249.0689 1261.7731 1268.1328 1277.1144 1279.3850 1282.3963 1290.1961 1298.8646 1304.7527 1315.9386 1321.4782 1323.9134 1327.2475 1332.8919 1342.1927 1345.3655 1350.2197 1352.0588 1356.6367 1371.7499 1373.4241 1383.3686 1387.6250 1391.0988 1445.3147 1453.6567 1461.5685 1465.5465 1468.3783 1468.7326 1470.2269 1472.1107 1474.1414 1480.4515 1482.5069 1486.0874 1493.4189 1500.1841 1583.1691 1623.0611 2901.7844 2913.8814 2920.4144 2949.2324 2952.0719 2959.0601 2970.0853 2971.5558 2974.2957 2979.7345 2981.1530 2984.4550 2985.9633 2990.2866 2996.5107 3034.4085 3035.4512 3035.7154 3038.7790 3040.1090 3041.4598 3046.1144 3062.2554 3063.2939 3069.5898 3075.1379 3078.3984 3080.3135 3082.7116 3090.8849 3117.0996 3544.6384
redmass: 5.5563 3.4329 4.2322 3.3703 4.0694 2.7195 2.4971 3.9351 1.9491 2.2093 2.1085 2.9924 1.7534 1.2951 1.6118 2.0605 2.1307 1.4352 1.3440 2.3491 2.5912 2.6851 3.4456 2.6085 2.6975 2.9357 3.3273 3.4068 2.8794 3.2279 2.9714 2.5425 3.6033 2.7974 2.5224 3.0692 2.9244 3.0029 2.8288 3.7044 3.3866 2.1425 2.6734 2.1265 2.1770 2.2243 1.9298 1.8759 2.3397 2.2607 1.4518 1.8211 1.9350 1.8225 1.7635 1.7762 2.4394 1.9707 2.3188 2.0873 1.9488 1.6556 2.8360 1.8881 1.9860 1.6934 2.0628 2.4035 2.3742 2.3185 1.6055 2.6272 1.7995 1.9790 1.6293 1.8757 2.3660 1.7178 1.5780 1.7741 1.8785 1.4721 2.3113 1.3896 1.3362 1.4948 1.6509 1.4532 1.4371 1.5657 1.4054 2.0263 1.3989 1.3449 1.3595 1.4401 1.5119 1.3919 1.4676 1.3858 1.3894 2.0645 1.5206 1.4997 1.3949 1.5111 1.1511 1.4394 1.2279 1.2095 1.2168 1.0780 1.0878 1.0749 1.0816 1.0791 1.0748 1.0587 1.0585 1.0856 1.0551 1.0828 1.0603 1.0659 1.0570 9.9956 7.7288 1.0810 1.0806 1.0820 1.0660 1.0658 1.0767 1.0667 1.0379 1.0644 1.0627 1.0607 1.0430 1.0368 1.0548 1.0633 1.0957 1.0885 1.0958 1.0987 1.0990 1.0980 1.1002 1.0956 1.1018 1.0964 1.0986 1.0990 1.0982 1.0990 1.0995 1.0911 1.0657
irintensity: 2.7823 2.2608 0.6639 1.2168 0.5475 1.2744 0.1902 3.0394 2.0402 3.5577 0.9467 0.4459 1.6884 12.0672 0.6762 5.1964 5.0038 14.5247 124.4531 0.8215 3.8022 3.6661 34.0556 6.1608 0.6675 3.9084 8.8139 1.1259 1.5268 2.3169 3.8374 3.0424 5.2910 0.3398 0.3871 6.0092 5.3327 4.0869 1.7531 0.2847 7.9733 4.0284 0.6136 6.4044 0.0617 5.0998 2.0400 2.6115 12.2173 14.1719 15.9348 3.9493 3.8880 5.7103 16.8821 1.8456 6.3924 18.5700 2.5382 10.8962 5.5966 20.9387 15.6766 6.4897 5.4200 12.6308 0.9070 1.8377 21.5779 0.5234 3.0584 0.0524 5.3388 6.9364 3.7611 1.5682 2.3880 8.1537 26.0241 1.4995 26.0853 14.9142 0.1917 5.1600 12.3165 13.5425 13.5989 0.6738 5.7896 6.9798 0.3036 36.5286 0.6609 3.0190 2.4495 2.5733 1.9406 4.7732 7.8398 1.3816 0.3345 6.4090 1.7791 4.4121 2.5057 2.5178 22.8080 15.5150 14.9312 10.3342 34.5464 17.1828 20.8006 4.9763 8.1673 10.6240 5.4585 4.1200 15.2754 3.3947 5.9505 2.8105 8.0526 7.4704 5.6704 163.9079 209.2050 3.5237 11.8912 27.2873 39.2766 16.0411 11.1186 39.0573 26.2406 24.6368 29.5368 37.4146 21.4733 1.5378 44.2165 47.3287 41.6330 4.1729 17.4911 20.7260 11.3135 75.5868 26.9467 22.5797 65.5029 55.1164 28.4224 51.2384 21.1912 26.7393 32.1270 11.3090 4.4387
temp: 298.150 k
press: 1.00000 atm
elementType: 8 8 6 6 6 6 6 6 6 6 6 6 6 6 6 6 6 6 6 6 6 6 6 1 1 1 1 1 1 1 1 1 1 1 1 1 1 1 1 1 1 1 1 1 1 1 1 1 1 1 1 1 1 1 1
symmnumber: 1
zpe: 1274074.2 jmol-1
zpe.correction: 0.485269 hartree
zpe.thermalcorrener: 0.507758 hartree
zpe.thermalcorrenthalpy: 0.508702 hartree
zpe.thermalcorrgfe: 0.435827 hartree
zpe.sumelectzpe: -968.085053 hartree
zpe.sumelectthermal: -968.062565 hartree
zpe.sumelectthermalent: -968.061620 hartree
zpe.sumelectthermalfe: -968.134496 hartree
dipole: -5.0495 1.3603 0.7627
dipole: 5.2848
quadrupole: -184.5207 -139.0223 -139.7640
quadrupole: -6.1937 19.1110 3.3192
quadrupole: -30.0850 15.4134 14.6717 -6.1937 19.1110 3.3192
hfenergy: -968.5703226 hartree
pointgroup: C01 [X(C21H32O2)]
dipole: 1.9885517 -0.5320691 0.2927445 debye
polarizability: 295.9701548|-8.5339656|206.7169273|12.3408802|-0.9378232|175.0978066 unknown
InChI: InChI=1S/C21H32O2/c1-13(22)17-6-7-18-16-5-4-14-12-15(23)8-10-20(14,2)19(16)9-11-21(17,18)3/h12-13,16-19,22H,4-11H2,1-3H3
charge 0 multiplicity 1
55 atoms
O  4.723351 2.120595 -0.19961
O  -6.168148 0.276302 -1.201532
C  2.315897 0.246959 0.185702
C  1.441918 -0.982492 -0.225199
C  0.0193 -0.971642 0.373922
C  -0.705648 0.336381 -0.080018
C  3.654598 -0.120881 -0.543873
C  1.595197 1.520288 -0.323382
C  -2.196415 0.450751 0.448699
C  2.360427 -2.20179 0.030692
C  0.142573 1.606229 0.217582
C  3.792647 -1.672284 -0.320975
C  -0.790437 -2.209987 -0.07009
C  2.552248 0.340255 1.717452
C  -2.942114 -0.853747 0.111717
C  -2.244813 -2.15587 0.457444
C  4.925676 0.650517 -0.130426
C  -2.885105 1.655286 -0.267258
C  -2.248088 0.652737 1.99759
C  -4.424104 1.652239 -0.164508
C  -4.19944 -0.869212 -0.439423
C  6.16091 0.251519 -0.959654
C  -5.017321 0.337755 -0.667481
H  1.313056 -0.905172 -1.331234
H  0.095415 -0.988828 1.482244
H  -0.789554 0.258922 -1.190003
H  3.493478 0.064033 -1.631446
H  1.567188 1.498707 -1.434636
H  2.156936 2.424956 -0.026802
H  2.081786 -3.077433 -0.582027
H  2.304138 -2.516346 1.090581
H  0.176267 1.789328 1.308334
H  -0.34446 2.492142 -0.230571
H  4.501618 -1.88152 0.5035
H  4.198984 -2.167743 -1.220598
H  -0.30361 -3.135499 0.291296
H  -0.801022 -2.260034 -1.178682
H  3.103323 -0.535048 2.106835
H  3.142055 1.24523 1.948338
H  1.60626 0.408051 2.281152
H  -2.213411 -2.259207 1.563494
H  -2.832334 -3.011744 0.077853
H  5.132445 0.483103 0.9416
H  -2.604189 1.630298 -1.340041
H  -2.494233 2.603659 0.144969
H  -1.708707 -0.145471 2.537033
H  -1.796597 1.619248 2.283064
H  -3.292279 0.648804 2.357653
H  -4.870833 2.484701 -0.736338
H  -4.74449 1.785563 0.889274
H  -4.681072 -1.822619 -0.694119
H  7.02949 0.863175 -0.65991
H  6.417818 -0.813329 -0.815069
H  5.977843 0.410823 -2.040898
H  4.548685 2.361643 -1.145719
