program: Gaussian 09
title: 000092751
version: EM64L-G09RevD.01
frameworkgroup: C1[X(C10H12N2O8)]
method: RPBEPBE
basis: SDD
operation: Freq
keyword: #p
keyword: freq=noraman
keyword: PBEPBE/SDD
title: #p freq=noraman PBEPBE/SDD
converged: YES YES NO NO
title: Mulliken charges:
elementType: O O O O O O O O N N C C C C C C C C C C H H H H H H H H H H H H
charge: -0.262696 -0.473088 -0.454024 -0.459359 -0.240444 -0.387644 -0.219965 -0.261328 -0.227070 -0.394525 -0.218384 -0.114615 -0.093050 -0.031490 -0.383797 0.348071 0.232322 -0.358423 0.154875 0.155480 0.284750 0.255388 0.246002 0.275232 0.213283 0.243755 0.385844 0.363363 0.294206 0.369570 0.352254 0.405507
chargesum: 0.00000
title: Mulliken charges with hydrogens summed into heavy atoms:
elementType: O O O O O O O O N N C C C C C C C C C C
charge: -0.262696 -0.087244 -0.090660 -0.107104 -0.240444 0.017863 -0.219965 -0.261328 -0.227070 -0.024955 0.066366 0.140773 0.152951 0.243742 0.073240 0.348071 0.232322 -0.064216 0.154875 0.155480
polarizability: 2.04435979e+02 9.89796443e+00 1.64385525e+02 1.19145954e+01 -4.16454877e+00 8.96541105e+01
1716.lowfreq: -10.7574 -4.9610 -1.5764 -0.0010 -0.0010 -0.0008 40.5076 54.6665 60.8497
frequency: 40.4437 54.6429 60.8393 80.7272 85.1263 103.6316 131.3853 160.3494 167.5279 170.9376 188.4742 200.1941 232.0844 246.2367 261.9063 289.1494 316.1933 349.7826 363.2747 387.1464 394.9053 441.3731 458.0870 483.5966 505.8909 516.5369 545.3016 560.1364 582.3839 622.1626 638.5292 649.3708 652.1274 677.2716 700.9448 722.2930 740.5980 777.9834 815.7146 847.8218 866.4365 886.8018 907.7328 930.2605 968.0796 975.9705 993.7485 1016.7254 1024.9378 1043.5488 1070.5643 1082.9633 1092.1862 1136.6166 1147.4954 1183.2796 1185.3676 1210.0214 1223.3278 1250.0701 1267.3164 1282.1357 1305.0761 1308.1849 1314.0816 1327.1427 1340.7216 1365.1630 1367.0800 1385.3623 1390.5621 1412.8958 1424.0089 1487.0894 1574.2521 1616.4029 1643.1335 1660.1551 2980.0711 3028.0919 3043.2647 3051.1107 3065.3290 3077.4765 3222.9197 3425.9754 3442.2271 3517.8368 3519.9970 3586.1809
redmass: 8.4768 7.5677 8.0179 5.9011 5.2228 6.9219 6.9702 7.4439 7.8919 6.4633 7.4115 2.7993 1.4061 4.3327 6.5698 4.5260 8.8030 8.2909 5.6623 7.1894 8.5016 3.5411 4.1475 1.5167 4.1121 3.5754 3.6868 4.1468 1.5834 1.6449 2.9991 4.7984 3.8476 2.8438 3.5278 5.2578 7.6351 1.8467 4.1871 3.5536 1.5933 3.6989 3.3376 3.7620 4.3823 6.7774 5.5251 3.1622 3.1240 4.5960 2.4039 2.2113 2.1579 4.0562 2.6038 1.2214 1.1459 2.8685 1.3342 1.2873 1.2117 1.2199 1.2347 2.3471 1.5596 1.6960 1.3979 1.5131 1.5908 1.5459 1.4968 1.5426 4.6531 1.0814 9.2246 8.7613 9.2227 6.1276 1.0594 1.0865 1.0851 1.1005 1.0865 1.0902 1.0941 1.0672 1.0643 1.0770 1.0645 1.0668
irintensity: 3.1696 3.0454 2.7737 5.3641 3.5215 0.2855 1.1334 15.1448 3.0837 3.9779 3.3814 28.1902 92.6739 36.9032 21.6043 23.8891 1.7348 16.5803 10.3187 13.0743 1.6482 12.5631 25.0201 127.9671 7.2552 1.0189 29.2924 66.0384 102.6610 116.6493 56.6427 18.0127 49.0404 5.1329 1.8789 11.5033 40.5863 113.0276 14.5451 49.9732 39.9011 10.7311 29.4231 40.9550 31.4097 135.4640 120.1537 16.7767 78.9453 35.6941 9.1187 236.4027 117.1250 37.3425 14.6553 8.4191 22.8000 69.6706 11.2547 37.6026 5.0558 7.6623 28.8899 74.8721 87.9752 101.1112 10.7629 22.0754 17.6065 12.4663 109.3113 12.9915 47.1231 6.8539 24.0556 350.1952 193.5063 691.8286 36.2217 23.3534 5.9480 17.0439 20.0208 24.6249 10.0499 281.2129 20.2950 74.5569 74.0733 6.7947
temp: 298.150 k
press: 1.00000 atm
elementType: 8 8 8 8 8 8 8 8 7 7 6 6 6 6 6 6 6 6 6 6 1 1 1 1 1 1 1 1 1 1 1 1
symmnumber: 1
zpe: 609201.0 jmol-1
zpe.correction: 0.232032 hartree
zpe.thermalcorrener: 0.250677 hartree
zpe.thermalcorrenthalpy: 0.251621 hartree
zpe.thermalcorrgfe: 0.185318 hartree
zpe.sumelectzpe: -1098.041710 hartree
zpe.sumelectthermal: -1098.023066 hartree
zpe.sumelectthermalent: -1098.022121 hartree
zpe.sumelectthermalfe: -1098.088424 hartree
dipole: -2.8801 1.2337 0.7652
dipole: 3.2253
quadrupole: -130.6967 -104.1699 -120.7155
quadrupole: -29.8660 3.1938 -4.9561
quadrupole: -12.1693 14.3574 -2.1881 -29.8660 3.1938 -4.9561
hfenergy: -1098.2737423 hartree
pointgroup: C01 [X(C10H12N2O8)]
dipole: 1.1188934 0.5587752 -0.214466 debye
polarizability: 203.6939836|-8.5097718|162.9220109|17.9885403|7.212953|91.8596199 unknown
InChI: InChI=1S/C10H12N2O8/c13-2-4-6(15)7(16)8(20-4)12-3(9(17)18)1-5(14)11-10(12)19/h1,4,6-8,11,13,15-17H,2H2
charge 0 multiplicity 1
32 atoms
O  -1.341631 -0.465252 1.116176
O  -1.382045 2.140828 -1.451805
O  -3.322983 1.813063 0.31518
O  -4.538963 -1.980024 -0.024248
O  -0.18685 -2.022878 -1.038594
O  2.860955 2.581793 1.233876
O  4.290959 -2.191254 0.265599
O  1.101383 2.814792 -0.249775
N  0.732018 -0.090869 -0.032699
N  2.039595 -2.057195 -0.360178
C  -1.514915 0.769558 -0.969553
C  -2.942028 0.58479 -0.380415
C  -0.622523 0.476361 0.269632
C  -2.776281 -0.529696 0.66524
C  -3.077392 -1.945352 0.159303
C  1.913201 0.576903 0.335176
C  0.790952 -1.432169 -0.519167
C  3.12597 -0.067289 0.446212
C  3.244292 -1.496667 0.146703
C  1.879211 2.072862 0.405726
H  -1.31531 0.043322 -1.775143
H  -3.690066 0.314929 -1.147988
H  -0.461179 1.409588 0.837025
H  -3.403665 -0.305366 1.543806
H  -2.745668 -2.670469 0.929676
H  -2.536625 -2.156808 -0.781285
H  -0.46646 2.484398 -1.252875
H  -2.956227 2.557941 -0.240359
H  4.029276 0.479527 0.715336
H  2.077107 -3.035963 -0.665131
H  -4.808304 -2.877868 -0.339382
H  2.858197 3.576966 1.196232
