program: Gaussian 09
title: 000092715
version: EM64L-G09RevD.01
frameworkgroup: C1[X(C14H18NS)]
method: RPBEPBE
basis: SDD
operation: Freq
keyword: #p
keyword: freq=noraman
keyword: PBEPBE/SDD
title: #p freq=noraman PBEPBE/SDD
converged: YES YES NO NO
title: Mulliken charges:
elementType: S N C C C C C C C C C C C C C C H H H H H H H H H H H H H H H H H H
charge: 0.288235 -0.153547 0.219983 0.393353 -0.395833 -0.231161 -0.312636 -0.291619 -0.567765 -0.044450 0.439348 -0.341513 -0.640553 -0.786915 -0.587941 -0.651459 0.263523 0.256977 0.262060 0.277388 0.263069 0.269288 0.262233 0.241272 0.256401 0.247382 0.252071 0.252716 0.239925 0.284424 0.288295 0.246991 0.245808 0.254648
chargesum: 1.00000
title: Mulliken charges with hydrogens summed into heavy atoms:
elementType: S N C C C C C C C C C C C C C C
charge: 0.288235 -0.153547 0.219983 0.393353 0.124666 -0.231161 -0.050576 -0.014231 -0.304696 0.224838 0.439348 -0.079279 0.104502 -0.042202 -0.015221 0.095989
polarizability: 3.15168168e+02 -7.64467397e+00 1.73556100e+02 1.44392219e+00 -6.81980649e+00 8.98423154e+01
1716.lowfreq: -13.2228 -6.1623 -0.0018 -0.0011 -0.0005 5.0202 26.9066 64.7364 70.8013
frequency: 26.7914 64.7313 70.7891 79.3417 95.4529 106.0189 111.9298 176.0213 183.7477 196.6082 220.8298 236.0706 246.4043 301.7825 326.2915 344.9262 377.0845 405.5272 420.6990 482.5157 508.0873 528.2285 533.1874 556.3180 590.4281 610.9374 661.8887 704.1835 732.4538 765.8564 791.9582 800.7480 817.4137 834.0513 848.8757 902.5671 926.4265 962.0629 977.5409 984.1656 992.9283 1010.8852 1035.8495 1044.9997 1052.3006 1069.0956 1086.1190 1103.3970 1163.5977 1177.7794 1190.6236 1203.3679 1236.7674 1249.0492 1267.6746 1278.2991 1291.1151 1311.9712 1346.8681 1377.3189 1386.6560 1399.3759 1407.1017 1407.4034 1420.4333 1450.8591 1464.6367 1465.7717 1467.8473 1469.2972 1473.3599 1479.0749 1482.3405 1509.6700 1517.8087 1572.2669 1592.5898 1629.1423 2989.6707 3000.9134 3003.2456 3031.6336 3041.7106 3068.4639 3092.3469 3095.8267 3101.1824 3104.7750 3105.1226 3114.6956 3126.8018 3143.4646 3146.4629 3157.5182 3188.9744 3210.2942
redmass: 3.8694 3.5931 2.9953 1.1459 3.1628 1.9573 3.2329 3.8108 3.1808 1.0800 4.1088 1.1308 4.0888 3.4492 3.5632 3.8985 3.9478 3.6854 3.3000 3.7529 3.9345 5.1892 3.3900 3.8774 4.9825 4.8928 4.2108 5.3681 4.2891 3.2048 1.3197 1.1601 1.4676 1.2881 3.0985 1.4399 3.0155 2.5231 1.3373 1.8325 1.3952 1.5522 1.2044 4.1427 1.5939 2.2943 1.9968 2.0271 2.6043 1.6421 1.4754 1.4273 1.6782 1.2284 1.2642 2.3200 1.5258 1.8014 1.3928 3.1529 2.3507 1.2025 1.2168 1.2324 6.4135 1.1348 1.4089 1.0441 1.1422 1.0369 1.5476 1.0486 1.0507 2.3910 1.1623 6.5933 6.3561 6.0670 1.0385 1.0363 1.0363 1.0561 1.0642 1.0972 1.1003 1.0987 1.1043 1.0992 1.0998 1.1023 1.1085 1.0923 1.0916 1.0925 1.0941 1.0942
irintensity: 0.6876 0.8742 0.2080 1.4495 0.4022 1.0307 0.3207 2.0830 0.2776 0.0585 1.4467 0.0468 0.9901 1.7289 0.0842 5.4381 8.7509 1.1223 7.5362 8.7691 7.5878 6.3514 3.1846 1.5623 6.1808 4.4056 4.8610 2.3438 4.4402 2.8401 5.3904 15.7181 28.4748 27.7844 9.5790 11.2559 1.5232 5.6490 0.3096 32.5591 3.0916 9.5727 2.0201 26.7636 13.4064 6.1484 16.6332 51.7856 39.3579 10.1542 21.2486 14.0108 1.2213 0.0093 16.2167 59.5995 1.9574 11.6940 2.9719 3.6741 11.1720 19.7096 49.0968 0.5501 23.2282 37.7679 23.2920 18.2076 9.8784 22.6320 14.5285 11.3936 3.0450 86.3251 29.1576 131.1096 114.9221 5.7250 5.3536 8.5307 6.2781 7.9354 6.2208 6.9987 1.6361 7.1948 2.1117 11.1031 12.4107 13.8093 17.1702 3.4317 3.8556 0.6329 2.4941 0.4243
temp: 298.150 k
press: 1.00000 atm
elementType: 16 7 6 6 6 6 6 6 6 6 6 6 6 6 6 6 1 1 1 1 1 1 1 1 1 1 1 1 1 1 1 1 1 1
symmnumber: 1
zpe: 749578.2 jmol-1
zpe.correction: 0.285499 hartree
zpe.thermalcorrener: 0.302040 hartree
zpe.thermalcorrenthalpy: 0.302984 hartree
zpe.thermalcorrgfe: 0.240826 hartree
zpe.sumelectzpe: -995.718521 hartree
zpe.sumelectthermal: -995.701980 hartree
zpe.sumelectthermalent: -995.701036 hartree
zpe.sumelectthermalfe: -995.763194 hartree
dipole: 0.2947 -0.8703 -0.0784
dipole: 0.9222
quadrupole: -41.8806 -75.3730 -103.7073
quadrupole: -5.9505 0.2904 -2.8057
quadrupole: 31.7731 -1.7194 -30.0536 -5.9505 0.2904 -2.8057
hfenergy: -996.0040199 hartree
pointgroup: C01 [X(C14H18N1S1)]
dipole: -0.1088516 0.3460786 -0.0039648 debye
polarizability: 314.557861|-10.1949147|172.5676121|-7.3882971|12.9161769|91.4411102 unknown
InChI: InChI=1S/C14H18NS/c1-4-15-13-8-6-11(3)10-12(13)7-9-14(15)16-5-2/h6-10H,4-5H2,1-3H3
charge 1 multiplicity 1
34 atoms
S  -3.26113 -0.394751 0.133349
N  -0.562342 -0.798618 -0.101492
C  0.816174 -0.474445 -0.035661
C  1.205367 0.88347 0.253829
C  -0.961265 -2.211334 -0.44006
C  -1.535743 0.142766 0.16666
C  1.834948 -1.447341 -0.244767
C  0.179955 1.849352 0.496925
C  2.590636 1.229964 0.302001
C  -1.160361 1.484247 0.465084
C  3.594531 0.277797 0.081541
C  3.181369 -1.068923 -0.187229
C  -1.016607 -3.121272 0.801538
C  5.064953 0.6300 0.126475
C  -4.251287 1.228396 0.365451
C  -5.73722 0.863347 0.263527
H  -1.945318 -2.168253 -0.936306
H  -0.251237 -2.585576 -1.192952
H  1.598133 -2.494743 -0.439125
H  0.457953 2.884361 0.721823
H  2.858704 2.26999 0.519903
H  -1.934266 2.223553 0.670414
H  3.949452 -1.833695 -0.349695
H  -0.037558 -3.191007 1.305266
H  -1.314812 -4.137405 0.490615
H  -1.760212 -2.761451 1.532425
H  5.592221 0.038105 0.897152
H  5.555722 0.408521 -0.839189
H  5.225924 1.696754 0.35035
H  -3.998804 1.633507 1.358611
H  -3.943203 1.922182 -0.433281
H  -5.992831 0.44303 -0.723707
H  -6.041689 0.146787 1.045185
H  -6.335157 1.781885 0.402238
