program: Gaussian 09
title: 000092710
version: EM64L-G09RevD.01
frameworkgroup: C1[X(C5H11O5PS)]
method: RPBEPBE
basis: SDD
operation: Freq
keyword: #p
keyword: freq=noraman
keyword: PBEPBE/SDD
title: #p freq=noraman PBEPBE/SDD
converged: YES YES NO NO
title: Mulliken charges:
elementType: S P O O O O O C C C C C H H H H H H H H H H H
charge: -0.010397 1.132335 -0.509316 -0.484963 -0.595998 -0.260860 -0.242026 -0.800101 0.375919 -0.494345 -0.484245 -0.501850 0.303128 0.341208 0.243716 0.283414 0.235570 0.255348 0.232416 0.249523 0.247030 0.239173 0.245321
chargesum: 0.00000
title: Mulliken charges with hydrogens summed into heavy atoms:
elementType: S P O O O O O C C C C C
charge: -0.010397 1.132335 -0.509316 -0.484963 -0.595998 -0.260860 -0.242026 -0.155766 0.375919 0.268354 0.253042 0.229675
polarizability: 1.53100592e+02 6.44287371e+00 1.05806132e+02 -3.47960224e+00 2.49107004e+00 9.16396402e+01
1716.lowfreq: -10.1097 -5.0512 -0.0018 0.0021 0.0026 10.4411 22.9492 48.6045 51.7469
frequency: 22.7693 48.3538 51.6185 61.6364 82.4211 84.5832 118.2735 124.5822 143.0174 149.5111 168.9123 184.1051 212.1273 225.4404 226.9875 282.8973 290.3250 340.4888 375.8056 394.5709 433.3488 546.0535 622.5830 659.9530 680.9053 715.4046 822.9705 898.1819 952.7128 964.7632 966.1952 1039.3613 1111.4451 1112.7816 1115.0964 1118.7013 1128.9049 1145.2276 1149.0536 1226.1134 1287.9725 1411.2380 1422.3794 1422.9533 1436.6431 1453.1376 1460.5275 1462.7948 1463.7141 1469.2830 1478.7427 1647.0880 2984.5364 2985.7777 2990.7752 3008.4715 3093.1196 3100.7531 3112.4009 3124.2455 3132.4259 3135.8877 3155.1234
redmass: 4.6488 5.0984 4.6711 3.4121 1.1522 3.3918 2.2975 1.1207 4.1366 1.4064 5.1644 3.8155 3.9664 6.7702 4.7339 10.7247 5.7998 6.3767 4.4485 7.0954 9.2880 3.7771 10.1739 5.5369 10.7284 5.9959 6.3196 2.0080 10.7555 6.1756 11.1055 15.3490 1.2408 1.3165 1.2450 2.0830 1.2844 1.2960 1.4419 1.3838 1.4101 1.0839 1.1822 1.1214 1.1164 1.0498 1.0496 1.0505 1.0477 1.0539 1.0544 9.4175 1.0328 1.0655 1.0293 1.0295 1.1021 1.1060 1.1049 1.0957 1.1046 1.1044 1.1050
irintensity: 1.0705 3.8571 0.7064 2.9980 0.2943 10.0460 4.1728 0.8426 3.9280 3.2828 0.9819 1.8804 5.7033 7.4844 9.6662 12.7060 16.8800 17.4549 5.4057 44.3387 78.1508 6.7636 165.8887 6.9569 106.6274 7.8437 6.8169 7.4015 189.8593 9.0678 123.1026 112.7982 0.2434 20.9889 1.1524 259.7973 1.1288 1.5074 11.9492 98.1043 36.1229 27.1741 19.2354 7.0287 1.2391 16.4777 11.6459 15.1934 10.7451 18.2313 22.5808 144.7840 38.1108 24.6514 40.3714 28.7141 24.7270 12.9085 22.5387 2.5157 11.6540 10.4373 15.0323
temp: 298.150 k
press: 1.00000 atm
elementType: 16 15 8 8 8 8 8 6 6 6 6 6 1 1 1 1 1 1 1 1 1 1 1
symmnumber: 1
zpe: 438061.6 jmol-1
zpe.correction: 0.166849 hartree
zpe.thermalcorrener: 0.183463 hartree
zpe.thermalcorrenthalpy: 0.184407 hartree
zpe.thermalcorrgfe: 0.120492 hartree
zpe.sumelectzpe: -1311.530575 hartree
zpe.sumelectthermal: -1311.513961 hartree
zpe.sumelectthermalent: -1311.513017 hartree
zpe.sumelectthermalfe: -1311.576932 hartree
dipole: -1.9434 0.0321 -2.8838
dipole: 3.4777
quadrupole: -65.6669 -82.4417 -93.6108
quadrupole: -2.5060 -8.5256 -0.1480
quadrupole: 14.9062 -1.8685 -13.0377 -2.5060 -8.5256 -0.1480
hfenergy: -1311.6974242 hartree
pointgroup: C01 [X(C5H11O5P1S1)]
dipole: -0.7371938 0.3086317 -1.1105463 debye
dipolederiv: -0.6343399 0.0043468 -0.1054713 -0.090301 -0.2631138 -0.0161178 -0.2818603 -0.0173495 -0.2780083 2.261876 0.0978111 0.0012545 -0.0765561 1.7712078 0.1446098 0.3734364 -0.2258273 1.3058873 -0.7127954 -0.1362251 0.0243409 -0.1406283 -1.253728 0.1016924 0.0216628 0.3249678 -0.514327 -1.0083467 0.3258916 0.2140948 0.3485789 -0.8076872 -0.2115252 0.2471925 -0.2501592 -0.6557796 -0.7277276 -0.0032636 -0.0209847 -0.0137566 -0.5717497 -0.0433527 -0.087778 0.0036856 -0.6997395 -1.5461141 0.3361222 0.1386415 0.3592666 -0.5821791 -0.0034743 0.1632458 -0.0076283 -0.312403 -0.8643103 0.0346013 0.0799143 -0.2304729 -0.7114395 0.1482811 0.1503117 0.1018547 -0.3144317 0.1155407 0.0259878 -0.0534058 0.0706513 -0.153654 0.0445178 -0.2917492 0.1615321 -0.0080797 1.8261765 -0.2506543 -0.1821988 -0.1259274 0.957364 -0.1632836 -0.1478953 -0.1951655 0.2409797 0.1108696 -0.1892779 0.0344631 0.1358399 0.7391352 -0.0899967 0.0114195 -0.0263352 0.238322 0.3865653 -0.0852269 -0.1047712 -0.0566616 0.3018137 0.09055 -0.3927244 0.3449691 0.4188074 0.4686284 -0.1471498 -0.0031734 -0.3211443 0.3984498 0.0271701 -0.0088608 0.0160846 0.2688404 -0.033453 -0.055045 0.0318268 0.0267072 0.0437499 -0.0131078 0.0577392 -0.0308116 0.1217808 0.1528897 0.0253858 -0.0225249 0.0867577 0.0694057 -0.0380888 0.0945171 -0.033554 0.0700152 0.1011982 0.0165042 -0.0294403 -0.0273446 -0.0715739 -0.0413938 -0.0423212 -0.118431 -0.0532592 0.0767423 0.0598604 -0.0663477 -0.0266688 0.0395312 -0.0126022 -0.0690759 -0.0236206 0.0944804 0.0406157 -0.0365838 0.0936529 -0.0359075 -0.0243947 0.0618555 0.0938849 0.0845159 -0.0110545 0.0449348 -0.0423082 0.0602448 -0.0973149 -0.0027376 0.0743681 0.1058989 -0.0031113 0.0055008 -0.0333311 -0.084796 -0.1000204 -0.0531759 0.0709506 -0.0443656 -0.0003606 -0.1034731 -0.0191597 -0.0060968 0.1326013 -0.0007282 0.1276901 -0.0060421 0.0099317 0.0188653 -0.0021721 0.072438 0.0385659 -0.0486754 -0.0830577 0.0654868 -0.0316378 -0.0757947 -0.0484868 -0.0829603 0.0019922 -0.1208622 0.0068111 0.0431468 -0.0310292 0.0743087 0.0152953 0.0510652 0.0083512 0.1136165 0.0627741 0.0132824 0.0505438 0.1059105 0.0140207 0.0348316 -0.0181269 0.0746379 -0.0864186 unknown
polarizability: 150.8104874|-11.542822|107.8271015|-4.1301433|4.1170568|91.9087755 unknown
InChI: InChI=1S/C3H5O2S.C2H6O3P/c1-5-3(4)2-6;1-4-6(3)5-2/h2H2,1H3;1-2H3
charge 0 multiplicity 1
23 atoms
S  -0.025807 -1.69177 -0.826932
P  1.713335 -1.069607 0.606204
O  2.615914 0.110167 -0.270701
O  2.85789 -2.346553 0.592524
O  1.175533 -0.716432 2.058806
O  -3.341175 0.134388 0.380698
O  -1.33487 1.166606 -0.195756
C  -1.403179 -1.246851 0.385108
C  -1.970253 0.141716 0.136001
C  2.03536 1.467961 -0.458158
C  3.419678 -2.817172 -0.696199
C  -4.02545 1.448268 0.268704
H  -2.184578 -2.015249 0.302612
H  -0.964958 -1.270776 1.402981
H  2.185931 2.060093 0.460022
H  0.959668 1.413685 -0.702752
H  2.605799 1.898265 -1.294483
H  3.933545 -1.993537 -1.21913
H  2.623306 -3.247545 -1.332072
H  4.134939 -3.601603 -0.409282
H  -3.5899 2.164765 0.984825
H  -5.076518 1.236097 0.507094
H  -3.918909 1.843783 -0.755013
