program: Gaussian 09
title: 000092697
version: EM64L-G09RevD.01
frameworkgroup: C1[X(C16H23ClO)]
method: RPBEPBE
basis: SDD
operation: Freq
keyword: #p
keyword: freq=noraman
keyword: PBEPBE/SDD
title: #p freq=noraman PBEPBE/SDD
converged: YES YES NO NO
title: Mulliken charges:
elementType: Cl O C C C C C C C C C C C C C C C C H H H H H H H H H H H H H H H H H H H H H H H
charge: -0.120669 -0.071656 0.498433 0.491676 0.605721 -0.237684 -0.244476 0.034851 -0.273940 -0.719223 -0.648421 -0.698414 -0.695483 -0.694675 -0.698589 -0.693208 -0.693625 -0.288940 0.234731 0.235347 0.214132 0.248310 0.243832 0.231939 0.219719 0.211193 0.211486 0.217399 0.238150 0.210335 0.217539 0.238715 0.232143 0.220019 0.209756 0.212639 0.215921 0.228401 0.228934 0.215742 0.211940
chargesum: 0.00000
title: Mulliken charges with hydrogens summed into heavy atoms:
elementType: Cl O C C C C C C C C C C C C C C C C
charge: -0.120669 -0.071656 0.498433 0.491676 0.605721 -0.002953 -0.009129 0.034851 -0.059808 -0.470913 -0.404589 -0.035563 -0.028448 -0.028087 -0.036671 -0.036248 -0.037009 -0.288940
polarizability: 2.15280775e+02 -4.96309923e-02 1.98567587e+02 1.66157127e+00 -5.78552768e-01 1.50969094e+02
1716.lowfreq: -10.4497 -2.3441 -0.0014 -0.0007 0.0009 4.8005 8.2707 13.4157 28.9993
frequency: -4.5100 12.3574 28.8920 36.3102 50.0907 84.0711 122.4081 123.2326 128.6583 131.6122 149.5615 207.0138 212.0524 221.0607 223.6495 235.6406 239.4903 247.7810 256.9097 261.6941 306.0187 307.9631 336.4680 347.6433 358.3514 388.1270 428.2539 455.8938 469.1524 500.0169 558.7698 590.6228 599.2656 626.3383 657.5848 670.9501 755.3656 807.0234 816.0903 851.7311 882.2634 905.7550 909.1367 918.7759 919.7917 921.8098 939.2863 949.1481 955.9204 958.6024 958.8241 1053.6392 1075.2686 1093.0501 1111.8435 1113.9845 1115.4108 1122.1444 1160.2266 1171.1332 1176.3743 1205.1216 1252.1378 1283.9256 1298.0391 1300.4378 1308.4589 1313.2425 1324.9965 1340.2017 1377.1838 1377.5691 1378.6302 1387.3301 1396.4421 1398.2545 1399.4480 1434.1182 1454.0022 1465.0955 1465.4517 1467.3756 1468.0387 1468.2936 1469.2132 1478.6489 1478.8948 1480.1484 1487.6470 1488.3122 1489.9035 1572.8355 1610.9437 1739.2035 2976.0155 2977.3149 2977.7140 2978.1865 2979.5910 2980.1531 2981.2237 2989.6592 2990.7518 3069.2294 3070.9465 3070.9960 3075.6682 3077.4490 3078.2825 3078.8178 3081.5515 3081.9762 3082.7422 3086.2831 3086.8820 3120.1831 3124.3571
redmass: 9.0400 2.9559 2.8834 2.8500 4.7136 2.9127 3.5392 3.6471 5.0953 3.6170 3.7449 1.5388 1.2980 1.0874 1.3086 1.3894 1.4267 1.3050 1.3316 1.9671 2.7944 3.1140 2.9493 3.5692 3.8266 11.9913 2.5262 3.2967 4.1659 4.1015 2.9950 3.0608 4.2720 4.2195 3.3884 5.3295 4.0510 3.8900 3.5736 3.5905 2.5617 1.7783 1.3531 1.1801 1.1858 1.2445 2.5868 2.2871 1.4583 1.4476 1.4741 1.5854 1.5783 1.7827 2.5739 2.5739 2.5739 2.1935 1.9909 2.5798 2.0494 1.6469 1.4688 2.3045 1.3321 1.3305 1.3235 2.0988 1.8143 2.3946 1.1921 1.1937 1.1925 2.0367 1.2169 1.2455 1.2409 2.6144 2.5597 1.0508 1.0506 1.0447 1.0476 1.0518 1.0465 1.0534 1.0524 1.0502 1.0723 1.0871 1.0644 7.5281 5.7863 13.1136 1.0348 1.0349 1.0349 1.0353 1.0355 1.0358 1.0838 1.0833 1.0834 1.0999 1.1001 1.1000 1.0992 1.0993 1.0992 1.1006 1.1005 1.1005 1.0998 1.1001 1.1001 1.0899 1.0906
irintensity: 0.0009 0.0216 0.0706 0.0103 0.5568 0.8060 0.4309 0.8265 1.1565 0.5170 0.0158 0.9735 0.6749 0.1472 0.5558 0.1249 0.1956 0.1420 0.0128 0.1554 0.9576 0.1487 0.6165 2.8649 4.5162 37.5773 0.2922 4.7132 1.6877 2.8758 4.3529 6.1359 77.4202 0.2803 10.5993 13.7918 115.3026 19.1040 2.8821 40.1253 1.0062 19.6606 0.3301 0.0752 5.7834 3.4466 27.1960 21.3340 0.0689 0.4487 2.2745 14.4291 15.3344 20.9155 1.6931 1.1526 0.2988 9.6763 5.9826 15.2138 9.1741 30.7066 11.0904 11.4566 0.7140 0.9350 0.7350 1.3047 4.6427 1.6158 10.9114 8.9818 32.8277 4.1226 14.8981 1.5919 14.4226 11.4368 0.9605 1.6071 5.2190 1.3298 0.2451 12.0955 0.4978 8.9351 7.5981 19.6605 14.8512 36.3441 0.3347 28.5925 49.9680 226.2302 24.4165 23.0285 30.8825 32.3233 42.7662 21.3467 16.6719 9.5238 23.1458 0.7845 0.4604 1.2971 119.5720 52.9492 96.7060 18.8347 16.2916 25.1152 35.3794 38.1182 26.5740 21.0752 10.7871
temp: 298.150 k
press: 1.00000 atm
elementType: 17 8 6 6 6 6 6 6 6 6 6 6 6 6 6 6 6 6 1 1 1 1 1 1 1 1 1 1 1 1 1 1 1 1 1 1 1 1 1 1 1
symmnumber: 1
zpe: 909712.3 jmol-1
zpe.correction: 0.346491 hartree
zpe.thermalcorrener: 0.367042 hartree
zpe.thermalcorrenthalpy: 0.367987 hartree
zpe.thermalcorrgfe: 0.295958 hartree
zpe.sumelectzpe: -1157.421976 hartree
zpe.sumelectthermal: -1157.401425 hartree
zpe.sumelectthermalent: -1157.400481 hartree
zpe.sumelectthermalfe: -1157.472510 hartree
dipole: 3.9720 -1.0014 -0.0902
dipole: 4.0973
quadrupole: -122.7077 -107.4707 -122.7428
quadrupole: 3.5418 -0.1081 0.2764
quadrupole: -5.0673 10.1697 -5.1024 3.5418 -0.1081 0.2764
hfenergy: -1157.7684674 hartree
pointgroup: C01 [X(C16H23Cl1O1)]
dipole: -1.5300677 -0.4967635 -0.1031353 debye
polarizability: 214.5401669|0.8984052|198.5397119|6.6902777|2.4326341|151.7375769 unknown
InChI: InChI=1S/C16H23ClO/c1-9(2)12-7-13(10(3)4)15(16(17)18)14(8-12)11(5)6/h7-11H,1-6H3
charge 0 multiplicity 1
41 atoms
Cl 3.11176 0.94422 1.587767
O  3.089291 0.903902 -1.153071
C  0.675019 -1.169674 -0.078765
C  -0.090261 1.202807 -0.082163
C  -1.741882 -0.637173 -0.00714
C  1.797557 -2.2136 -0.073465
C  0.216827 2.70479 -0.083026
C  0.948311 0.226784 -0.110772
C  -3.195625 -1.113383 0.042416
C  -0.680549 -1.571134 -0.028687
C  -1.424351 0.743026 -0.031644
C  1.690303 -3.179123 -1.282879
C  1.823433 -2.991656 1.269834
C  -0.199847 3.355806 1.263494
C  -0.443187 3.427678 -1.286505
C  -3.980026 -0.681265 -1.225866
C  -3.915621 -0.626522 1.32858
C  2.36535 0.682917 -0.191596
H  2.769004 -1.688393 -0.161163
H  1.311663 2.841288 -0.181821
H  -3.183669 -2.221823 0.065789
H  -0.917283 -2.641959 -0.005518
H  -2.234958 1.481076 -0.011295
H  1.710218 -2.626969 -2.239398
H  2.534725 -3.892486 -1.277131
H  0.753876 -3.76579 -1.247284
H  0.885764 -3.557843 1.420655
H  2.661394 -3.712688 1.278444
H  1.949872 -2.302921 2.123757
H  -1.2904 3.271894 1.425619
H  0.063208 4.429536 1.267648
H  0.312227 2.869941 2.112741
H  -0.11487 2.990367 -2.246291
H  -0.171907 4.499361 -1.283363
H  -1.545973 3.360417 -1.241378
H  -4.043572 0.420471 -1.298325
H  -5.011975 -1.077394 -1.195499
H  -3.492265 -1.052881 -2.14486
H  -3.380345 -0.956152 2.237062
H  -4.94614 -1.025273 1.368402
H  -3.980494 0.477121 1.355597
